program: Orca
programVersion: 5.0.2
elementType: Br Br Br Br O O O N C C C C C C C C C C C C C C C C C C C C C C H H H H H H H H H H H H H H H H H H H
charge: 0
multiplicity: 1
keywords: wb97x-d3
keywords: def2-TZVPP
keywords: def2/J RIJCOSX
keywords: DEFGRID2
keywords: scfconv7
keywords: smallprint printgap noloewdin
keywords: NOSOSCF
formula: C22H19Br4NO3
InChI: InChI=1/C22H19Br4NO3/c1-21(2)17(19(23)22(24,25)26)18(21)20(28)30-16(12-27)13-7-6-10-15(11-13)29-14-8-4-3-5-9-14/h3-11,16-19H,1-2H3
49 atoms
Br 4.082627 -2.080948 1.300423
Br 2.521909 -3.247903 -1.556324
Br 0.979883 -0.526497 -1.782403
Br 4.112239 -0.541967 -1.764529
O  -2.062944 -0.213121 0.890175
O  -1.592982 -2.391823 0.767022
O  -3.94907 4.3392 0.055886
N  -3.26767 -1.116292 -2.127684
C  0.873959 -1.463382 2.57707
C  1.271726 -1.757579 1.166925
C  0.105606 -0.83435 1.428021
C  2.508232 -1.213018 0.514806
C  1.664186 -0.494723 3.423701
C  0.276777 -2.595894 3.374573
C  -1.237713 -1.267672 1.007638
C  2.543212 -1.392996 -1.013555
C  -3.371479 -0.470207 0.407871
C  -4.215881 0.770881 0.561617
C  -3.299141 -0.845455 -1.011717
C  -3.692381 2.027001 0.28342
C  -5.542813 0.629252 0.9427
C  -4.510834 3.143136 0.385892
C  -6.351609 1.75295 1.026639
C  -5.848037 3.012431 0.746471
C  -4.36639 5.498138 0.655405
C  -4.529943 6.608604 -0.159692
C  -4.55752 5.590112 2.028767
C  -4.888058 7.824032 0.406517
C  -4.928077 6.808608 2.578931
C  -5.095499 7.928384 1.774779
H  0.995119 -2.755209 0.840438
H  0.287331 0.228252 1.310587
H  2.623557 -0.145893 0.725506
H  1.016156 -0.060838 4.187225
H  2.481025 -1.003924 3.936115
H  2.085677 0.332758 2.852691
H  -0.255832 -3.320531 2.761828
H  1.072086 -3.131536 3.895814
H  -0.414673 -2.215651 4.128514
H  -3.836515 -1.299968 0.948355
H  -2.659896 2.153634 -0.019224
H  -5.945815 -0.350492 1.165559
H  -7.390198 1.648376 1.31112
H  -6.496281 3.87705 0.8069
H  -4.371516 6.522197 -1.227472
H  -4.417551 4.727077 2.667868
H  -5.011272 8.690496 -0.230346
H  -5.080332 6.880932 3.648173
H  -5.38159 8.875586 2.212727
elementType: Br O N C H
nucrepener: 5461.68192519 hartree
twoeener: 9866.12995738 hartree
cpcmener: -0.03270148 hartree
xcener: -389.799406697047 hartree
chargesum: -0.0000000
charge: -0.081820 -0.010380 -0.014687 -0.002100 -0.274894 -0.425413 -0.323874 -0.085640 0.098026 -0.099415 -0.134286 -0.153571 -0.261754 -0.259121 0.375785 0.043520 0.419038 0.011803 -0.239417 -0.214322 -0.191877 0.235404 -0.140933 -0.173914 0.277858 -0.240877 -0.193523 -0.124250 -0.143035 -0.181289 0.117717 0.119424 0.166413 0.109299 0.098838 0.091591 0.094260 0.099021 0.102770 0.131870 0.133107 0.146443 0.160048 0.158166 0.146148 0.158251 0.158136 0.159021 0.158435
qa: -0.0818 -0.0104 -0.0147 -0.0021 -0.2749 -0.4254 -0.3239 -0.0856 0.0980 -0.0994 -0.1343 -0.1536 -0.2618 -0.2591 0.3758 0.0435 0.4190 0.0118 -0.2394 -0.2143 -0.1919 0.2354 -0.1409 -0.1739 0.2779 -0.2409 -0.1935 -0.1243 -0.1430 -0.1813 0.1177 0.1194 0.1664 0.1093 0.0988 0.0916 0.0943 0.0990 0.1028 0.1319 0.1331 0.1464 0.1600 0.1582 0.1461 0.1583 0.1581 0.1590 0.1584
va: 1.1826 1.2245 1.2306 1.2304 2.1502 2.0810 2.0815 3.1079 3.8655 3.7374 3.8890 4.0618 3.9021 3.9008 4.1775 4.3502 3.7171 3.7530 4.0124 4.0638 3.9684 3.8156 3.9177 3.9029 3.6907 4.0078 3.9170 3.8863 3.8899 3.9034 1.0469 1.0207 0.9955 1.0031 1.0056 1.0034 1.0171 1.0023 1.0001 1.0227 1.0302 1.0024 0.9914 0.9950 1.0077 0.9956 0.9892 0.9903 0.9903
dispcorr: -0.028404035 hartree
energy: -11427.174164347723
dipole: -145.78366 144.75181 -1.03185 87.30681 -85.38285 1.92395 69.24186 -66.12584 3.11602
magnitude: 3.80472 au
magnitude: 9.67084 debye
