program: Orca
programVersion: 5.0.2
elementType: Br Br Br Br O O O N C C C C C C C C C C C C C C C C C C C C C C H H H H H H H H H H H H H H H H H H H
charge: 0
multiplicity: 1
keywords: wb97x-d3
keywords: def2-TZVPP
keywords: def2/J RIJCOSX
keywords: DEFGRID2
keywords: scfconv7
keywords: smallprint printgap noloewdin
keywords: NOSOSCF
formula: C22H19Br4NO3
InChI: InChI=1/C22H19Br4NO3/c1-21(2)17(19(23)22(24,25)26)18(21)20(28)30-16(12-27)13-7-6-10-15(11-13)29-14-8-4-3-5-9-14/h3-11,16-19H,1-2H3
49 atoms
Br 4.500626 -1.710726 0.340769
Br 2.056499 -3.681408 1.766242
Br 0.177976 -3.050311 -0.678238
Br 2.974858 -4.372225 -1.161257
O  -1.350327 1.000343 -0.204543
O  -0.631142 0.190194 1.750788
O  -4.669074 5.642172 0.106863
N  -4.052275 -0.897957 0.432373
C  2.139851 0.863664 0.250128
C  1.918022 -0.593235 0.511448
C  0.828175 0.207162 -0.149843
C  2.627447 -1.677472 -0.244356
C  3.006131 1.328796 -0.895704
C  2.203744 1.776982 1.448481
C  -0.424229 0.442463 0.593007
C  2.024091 -3.082249 -0.070304
C  -2.617713 1.290584 0.370844
C  -3.291064 2.352196 -0.459381
C  -3.416327 0.058332 0.405038
C  -3.657845 3.538796 0.15478
C  -3.530214 2.157788 -1.81577
C  -4.282234 4.53573 -0.584683
C  -4.146462 3.163538 -2.542047
C  -4.530802 4.353586 -1.938183
C  -4.718685 6.869721 -0.499629
C  -5.840945 7.648857 -0.262145
C  -3.662966 7.354085 -1.261921
C  -5.904714 8.930399 -0.790984
C  -3.745729 8.63267 -1.79398
C  -4.86233 9.425325 -1.561802
H  1.73938 -0.82131 1.557376
H  0.700688 0.096352 -1.221269
H  2.650126 -1.461855 -1.316112
H  4.049979 1.402612 -0.588766
H  2.956515 0.677589 -1.768529
H  2.687876 2.321429 -1.219099
H  3.236441 1.856752 1.79237
H  1.863321 2.780931 1.188586
H  1.608333 1.424617 2.288871
H  -2.511428 1.639555 1.401761
H  -3.468074 3.695059 1.210112
H  -3.248294 1.232672 -2.303013
H  -4.343781 3.020846 -3.59633
H  -5.025802 5.118493 -2.522763
H  -6.652671 7.257472 0.338303
H  -2.781545 6.749025 -1.435291
H  -6.778571 9.540368 -0.601714
H  -2.924297 9.012629 -2.387735
H  -4.916892 10.423309 -1.976363
elementType: Br O N C H
nucrepener: 5362.56575031 hartree
twoeener: 9766.51895483 hartree
cpcmener: -0.03239832 hartree
xcener: -389.798292712858 hartree
chargesum: -0.0000000
charge: -0.082953 -0.010942 -0.013082 -0.003852 -0.273440 -0.428642 -0.324975 -0.084965 0.093348 -0.093276 -0.149620 -0.155412 -0.263603 -0.257452 0.393975 0.041743 0.419236 0.009261 -0.233036 -0.205493 -0.223326 0.252730 -0.144934 -0.170248 0.270548 -0.238557 -0.187240 -0.125832 -0.145027 -0.177824 0.114579 0.120347 0.168932 0.099128 0.092342 0.108878 0.099907 0.103723 0.093708 0.123338 0.136950 0.150993 0.160362 0.158189 0.147335 0.157844 0.157986 0.159994 0.158352
qa: -0.0830 -0.0109 -0.0131 -0.0039 -0.2734 -0.4286 -0.3250 -0.0850 0.0933 -0.0933 -0.1496 -0.1554 -0.2636 -0.2575 0.3940 0.0417 0.4192 0.0093 -0.2330 -0.2055 -0.2233 0.2527 -0.1449 -0.1702 0.2705 -0.2386 -0.1872 -0.1258 -0.1450 -0.1778 0.1146 0.1203 0.1689 0.0991 0.0923 0.1089 0.0999 0.1037 0.0937 0.1233 0.1370 0.1510 0.1604 0.1582 0.1473 0.1578 0.1580 0.1600 0.1584
va: 1.1820 1.2239 1.2282 1.2280 2.1590 2.0822 2.0772 3.1104 3.8730 3.7374 3.8796 4.0662 3.8998 3.9009 4.1815 4.3487 3.6995 3.7433 4.0407 4.0326 3.9934 3.7938 3.9249 3.9123 3.6953 4.0078 3.9203 3.8862 3.8903 3.9002 1.0485 1.0208 0.9940 1.0055 1.0035 1.0027 1.0027 1.0004 1.0167 1.0308 1.0167 1.0086 0.9911 0.9957 1.0071 0.9961 0.9893 0.9899 0.9903
dispcorr: -0.027964473 hartree
energy: -11427.174366633708
dipole: -108.26741 109.07862 0.81122 180.24552 -176.99993 3.24560 -15.56693 13.78467 -1.78226
magnitude: 3.79057 au
magnitude: 9.63486 debye
