program: Orca
programVersion: 5.0.2
elementType: Br Br Br Br O O O N C C C C C C C C C C C C C C C C C C C C C C H H H H H H H H H H H H H H H H H H H
charge: 0
multiplicity: 1
keywords: wb97x-d3
keywords: def2-TZVPP
keywords: def2/J RIJCOSX
keywords: DEFGRID2
keywords: scfconv7
keywords: smallprint printgap noloewdin
keywords: NOSOSCF
formula: C22H19Br4NO3
InChI: InChI=1/C22H19Br4NO3/c1-21(2)17(19(23)22(24,25)26)18(21)20(28)30-16(12-27)13-7-6-10-15(11-13)29-14-8-4-3-5-9-14/h3-11,16-19H,1-2H3
49 atoms
Br 3.150858 -3.976757 0.15352
Br 4.146641 -0.677268 0.256294
Br 1.568002 0.033445 1.890937
Br 3.570051 -2.103566 3.002962
O  -1.725893 0.162096 -0.500816
O  -0.046098 0.228712 -1.967929
O  -6.783123 3.087274 -1.329187
N  -0.532015 3.316107 -0.310363
C  0.132871 -2.855815 -1.20577
C  1.210673 -2.054417 -0.551036
C  -0.224522 -1.600954 -0.428341
C  1.949298 -2.513975 0.671189
C  -0.356394 -4.145858 -0.592219
C  0.098421 -2.868622 -2.713415
C  -0.615912 -0.334739 -1.069996
C  2.760377 -1.416477 1.382452
C  -2.197287 1.410133 -0.980383
C  -3.543137 1.692402 -0.358034
C  -1.247205 2.468959 -0.611172
C  -4.531221 2.255925 -1.15158
C  -3.779295 1.426408 0.986214
C  -5.763734 2.566208 -0.588603
C  -5.022335 1.718145 1.52444
C  -6.016331 2.294945 0.747405
C  -6.521497 4.063907 -2.254294
C  -7.187192 3.984228 -3.468692
C  -5.671787 5.128118 -1.976939
C  -7.001763 4.983644 -4.413783
C  -5.488504 6.114172 -2.935544
C  -6.149685 6.048208 -4.155025
H  1.809607 -1.478381 -1.249542
H  -0.72277 -1.795056 0.515065
H  1.26084 -2.938886 1.406755
H  0.246632 -4.98952 -0.929138
H  -0.346276 -4.137435 0.4977
H  -1.386029 -4.332378 -0.901752
H  0.70245 -3.699424 -3.082268
H  -0.920759 -3.014162 -3.075294
H  0.490095 -1.958165 -3.161671
H  -2.282808 1.406421 -2.07118
H  -4.33942 2.447892 -2.200995
H  -3.00886 0.997163 1.613295
H  -5.218303 1.507809 2.567518
H  -6.982977 2.532514 1.173318
H  -7.84774 3.149894 -3.669186
H  -5.161365 5.197598 -1.024237
H  -7.522584 4.9216 -5.360621
H  -4.826979 6.943427 -2.720163
H  -6.003349 6.822699 -4.896331
elementType: Br O N C H
nucrepener: 5436.09998003 hartree
twoeener: 9840.18561718 hartree
cpcmener: -0.03263965 hartree
xcener: -389.800537335758 hartree
chargesum: 0.0000000
charge: -0.080309 -0.011905 -0.013203 -0.001451 -0.273103 -0.429038 -0.328338 -0.086098 0.097218 -0.096583 -0.140866 -0.154788 -0.261288 -0.260836 0.384439 0.040239 0.413398 0.019347 -0.239072 -0.161354 -0.201526 0.221812 -0.142962 -0.201000 0.257448 -0.239603 -0.172965 -0.122937 -0.147651 -0.180926 0.119083 0.119439 0.167673 0.099226 0.091135 0.109394 0.099573 0.103632 0.094480 0.133188 0.145258 0.145930 0.157669 0.149685 0.146692 0.156851 0.157484 0.159562 0.157946
qa: -0.0803 -0.0119 -0.0132 -0.0015 -0.2731 -0.4290 -0.3283 -0.0861 0.0972 -0.0966 -0.1409 -0.1548 -0.2613 -0.2608 0.3844 0.0402 0.4134 0.0193 -0.2391 -0.1614 -0.2015 0.2218 -0.1430 -0.2010 0.2574 -0.2396 -0.1730 -0.1229 -0.1477 -0.1809 0.1191 0.1194 0.1677 0.0992 0.0911 0.1094 0.0996 0.1036 0.0945 0.1332 0.1453 0.1459 0.1577 0.1497 0.1467 0.1569 0.1575 0.1596 0.1579
va: 1.1844 1.2225 1.2303 1.2309 2.1511 2.0770 2.0734 3.1081 3.8635 3.7360 3.9011 4.0653 3.9026 3.9000 4.1679 4.3498 3.7249 3.7077 4.0094 3.9451 3.9682 3.7826 3.9331 3.9960 3.7103 4.0039 3.8992 3.8869 3.8966 3.9011 1.0451 1.0203 0.9939 1.0060 1.0039 1.0027 1.0022 0.9999 1.0178 1.0228 1.0057 1.0127 0.9904 1.0039 1.0074 0.9969 0.9892 0.9902 0.9903
dispcorr: -0.028618364 hartree
energy: -11427.174560838457
dipole: -164.02751 161.72962 -2.29789 67.10263 -68.72544 -1.62281 -73.01543 72.77118 -0.24424
magnitude: 2.82373 au
magnitude: 7.17736 debye
