program: Orca
programVersion: 5.0.2
elementType: Br Br Br Br O O O N C C C C C C C C C C C C C C C C C C C C C C H H H H H H H H H H H H H H H H H H H
charge: 0
multiplicity: 1
keywords: wb97x-d3
keywords: def2-TZVPP
keywords: def2/J RIJCOSX
keywords: DEFGRID2
keywords: scfconv7
keywords: smallprint printgap noloewdin
keywords: NOSOSCF
formula: C22H19Br4NO3
InChI: InChI=1/C22H19Br4NO3/c1-21(2)17(19(23)22(24,25)26)18(21)20(28)30-16(12-27)13-7-6-10-15(11-13)29-14-8-4-3-5-9-14/h3-11,16-19H,1-2H3
49 atoms
Br 4.124781 -1.351557 -0.598501
Br 2.93281 -0.677458 2.592616
Br 0.557092 -2.662417 2.062723
Br 3.505548 -3.674708 1.831928
O  -2.286092 -0.57528 -0.318011
O  -0.876714 1.046364 0.306369
O  -3.645797 4.846436 -1.521822
N  -5.435173 -1.291516 0.438688
C  0.962928 -0.454209 -1.778777
C  1.407784 -0.685402 -0.369787
C  -0.031258 -0.934804 -0.734643
C  2.320274 -1.814356 0.007703
C  1.292005 -1.451917 -2.865678
C  0.938861 0.969277 -2.278889
C  -1.062989 -0.032336 -0.183473
C  2.349079 -2.157493 1.505527
C  -3.379258 0.267052 0.029114
C  -3.673402 1.261263 -1.06841
C  -4.519081 -0.624124 0.253263
C  -3.557593 2.617458 -0.8146
C  -4.040747 0.811134 -2.331422
C  -3.817621 3.533411 -1.825992
C  -4.28841 1.732597 -3.333867
C  -4.179451 3.094097 -3.092692
C  -4.447994 5.791333 -2.099164
C  -5.829989 5.652928 -2.134591
C  -3.838647 6.931035 -2.600178
C  -6.598652 6.668373 -2.680808
C  -4.62094 7.943513 -3.134999
C  -6.00074 7.815454 -3.182746
H  1.572617 0.225959 0.19639
H  -0.352733 -1.962524 -0.857706
H  2.054621 -2.733194 -0.521012
H  2.285281 -1.265972 -3.274742
H  1.260069 -2.488266 -2.529074
H  0.572773 -1.36004 -3.680584
H  1.910649 1.216637 -2.708568
H  0.187302 1.093329 -3.060281
H  0.729976 1.692866 -1.495163
H  -3.177615 0.79417 0.966939
H  -3.254912 2.975692 0.161088
H  -4.140282 -0.248268 -2.530596
H  -4.572009 1.391292 -4.320331
H  -4.373537 3.803779 -3.886273
H  -6.30297 4.765663 -1.733312
H  -2.761254 7.022414 -2.560171
H  -7.675134 6.562782 -2.705346
H  -4.145043 8.834959 -3.52146
H  -6.607282 8.605855 -3.603329
nucrepener: 5422.65295520 hartree
twoeener: 9826.19436613 hartree
xcener: -389.812100853288 hartree
chargesum: 0.0000000
charge: -0.059788 0.002553 -0.006585 0.008099 -0.258174 -0.367026 -0.295471 0.000148 0.072775 -0.068204 -0.171623 -0.181134 -0.245975 -0.244227 0.365056 0.034534 0.319848 0.016164 -0.258477 -0.144384 -0.186289 0.184704 -0.114773 -0.136435 0.219875 -0.148596 -0.198513 -0.120225 -0.097087 -0.137100 0.122509 0.103665 0.150635 0.101357 0.075556 0.102116 0.096205 0.090889 0.100560 0.119971 0.114526 0.124040 0.130711 0.135977 0.135552 0.127872 0.129460 0.126863 0.127866
qa: -0.0598 0.0026 -0.0066 0.0081 -0.2582 -0.3670 -0.2955 0.0001 0.0728 -0.0682 -0.1716 -0.1811 -0.2460 -0.2442 0.3651 0.0345 0.3198 0.0162 -0.2585 -0.1444 -0.1863 0.1847 -0.1148 -0.1364 0.2199 -0.1486 -0.1985 -0.1202 -0.0971 -0.1371 0.1225 0.1037 0.1506 0.1014 0.0756 0.1021 0.0962 0.0909 0.1006 0.1200 0.1145 0.1240 0.1307 0.1360 0.1356 0.1279 0.1295 0.1269 0.1279
va: 1.2044 1.2352 1.2345 1.2410 2.1316 2.1411 2.1071 3.1202 3.8899 3.7002 3.9311 4.1161 3.8994 3.9056 4.2042 4.3505 3.8327 3.6445 4.0231 4.0380 4.0286 3.9267 3.9561 3.9365 3.8180 3.9429 4.0331 3.9496 3.9386 3.9554 1.0442 1.0274 1.0028 1.0087 1.0091 1.0052 1.0035 1.0024 1.0205 1.0187 1.0301 1.0173 1.0008 1.0027 1.0025 1.0127 0.9996 0.9989 0.9998
dispcorr: -0.028950030 hartree
energy: -11427.143108339060
dipole: -137.59661 137.79544 0.19883 114.31505 -113.45107 0.86398 -93.98329 92.37636 -1.60693
magnitude: 1.83527 au
magnitude: 4.66489 debye
