program: Orca
programVersion: 5.0.2
elementType: Br Br Br Br O O O N C C C C C C C C C C C C C C C C C C C C C C H H H H H H H H H H H H H H H H H H H
charge: 0
multiplicity: 1
keywords: wb97x-d3
keywords: def2-TZVPP
keywords: def2/J RIJCOSX
keywords: DEFGRID2
keywords: scfconv7
keywords: smallprint printgap noloewdin
keywords: NOSOSCF
formula: C22H19Br4NO3
InChI: InChI=1/C22H19Br4NO3/c1-21(2)17(19(23)22(24,25)26)18(21)20(28)30-16(12-27)13-7-6-10-15(11-13)29-14-8-4-3-5-9-14/h3-11,16-19H,1-2H3
49 atoms
Br 4.028164 -1.505798 -0.836738
Br 3.155939 -0.385413 2.318534
Br 0.720404 -2.374161 2.301669
Br 3.624719 -3.474971 1.940747
O  -2.356629 -0.840917 -0.20803
O  -1.014493 0.90472 0.193534
O  -4.730434 4.410812 -1.119129
N  -5.389552 -1.757215 0.72722
C  0.805952 -0.715217 -1.846809
C  1.331632 -0.793332 -0.448753
C  -0.11378 -1.124015 -0.709279
C  2.288925 -1.862077 -0.007687
C  1.111741 -1.799308 -2.854213
C  0.70234 0.654777 -2.471516
C  -1.162385 -0.221452 -0.189377
C  2.456651 -1.992279 1.515223
C  -3.474611 -0.061526 0.191938
C  -3.912374 0.906093 -0.881715
C  -4.538397 -1.025017 0.485827
C  -4.099519 2.237319 -0.559377
C  -4.130827 0.457134 -2.179846
C  -4.530366 3.133561 -1.531618
C  -4.545461 1.360133 -3.141759
C  -4.751918 2.697428 -2.831179
C  -4.816326 5.414564 -2.047332
C  -6.022104 6.079511 -2.197087
C  -3.701606 5.786367 -2.786167
C  -6.109716 7.135269 -3.093425
C  -3.80326 6.837761 -3.682891
C  -5.004901 7.514538 -3.840267
H  1.496291 0.174064 0.01531
H  -0.392984 -2.171812 -0.712076
H  1.979816 -2.843467 -0.376326
H  2.05918 -1.606844 -3.357573
H  1.166107 -2.795942 -2.416115
H  0.329738 -1.826462 -3.614335
H  1.642759 0.89582 -2.969096
H  -0.088926 0.679284 -3.22257
H  0.500559 1.439052 -1.746232
H  -3.252399 0.48613 1.113762
H  -3.911103 2.596389 0.44459
H  -3.989922 -0.584963 -2.435696
H  -4.724787 1.022199 -4.153706
H  -5.088161 3.382929 -3.597361
H  -6.87858 5.775319 -1.609871
H  -2.763696 5.262384 -2.653033
H  -7.04894 7.659599 -3.208787
H  -2.93527 7.133761 -4.256817
H  -5.077122 8.337618 -4.538154
nucrepener: 5426.22857797 hartree
twoeener: 9829.71987271 hartree
xcener: -389.809870148349 hartree
chargesum: 0.0000000
charge: -0.061305 0.001303 -0.006386 0.008673 -0.260737 -0.358424 -0.292793 0.000271 0.074174 -0.067506 -0.165361 -0.181282 -0.245727 -0.242705 0.346541 0.036617 0.308382 0.045581 -0.251731 -0.154312 -0.207188 0.211743 -0.118719 -0.147434 0.194255 -0.166862 -0.146673 -0.112396 -0.121219 -0.123167 0.121280 0.102874 0.148845 0.100631 0.076442 0.102381 0.096928 0.089918 0.099399 0.120536 0.107883 0.124918 0.129725 0.132304 0.128714 0.134767 0.128885 0.129408 0.128548
qa: -0.0613 0.0013 -0.0064 0.0087 -0.2607 -0.3584 -0.2928 0.0003 0.0742 -0.0675 -0.1654 -0.1813 -0.2457 -0.2427 0.3465 0.0366 0.3084 0.0456 -0.2517 -0.1543 -0.2072 0.2117 -0.1187 -0.1474 0.1943 -0.1669 -0.1467 -0.1124 -0.1212 -0.1232 0.1213 0.1029 0.1488 0.1006 0.0764 0.1024 0.0969 0.0899 0.0994 0.1205 0.1079 0.1249 0.1297 0.1323 0.1287 0.1348 0.1289 0.1294 0.1285
va: 1.2022 1.2342 1.2344 1.2412 2.1227 2.1508 2.1110 3.1203 3.8853 3.7018 3.9123 4.1213 3.9017 3.9049 4.2219 4.3560 3.8460 3.6586 4.0193 4.0751 4.0214 3.9154 3.9715 3.9247 3.8448 4.0211 3.9799 3.9391 3.9418 3.9426 1.0452 1.0284 1.0035 1.0088 1.0079 1.0051 1.0036 1.0032 1.0209 1.0191 1.0277 1.0188 1.0005 1.0074 1.0105 1.0029 0.9991 0.9995 0.9996
dispcorr: -0.028906914 hartree
energy: -11427.142802121947
dipole: -141.71758 142.06843 0.35085 101.44215 -100.46820 0.97395 -94.24022 92.51708 -1.72314
magnitude: 2.01019 au
magnitude: 5.10951 debye
