program: Orca
programVersion: 5.0.2
elementType: Br Br Br Br O O O N C C C C C C C C C C C C C C C C C C C C C C H H H H H H H H H H H H H H H H H H H
charge: 0
multiplicity: 1
keywords: wb97x-d3
keywords: def2-TZVPP
keywords: def2/J RIJCOSX
keywords: DEFGRID2
keywords: scfconv7
keywords: smallprint printgap noloewdin
keywords: NOSOSCF
formula: C22H19Br4NO3
InChI: InChI=1/C22H19Br4NO3/c1-21(2)17(19(23)22(24,25)26)18(21)20(28)30-16(12-27)13-7-6-10-15(11-13)29-14-8-4-3-5-9-14/h3-11,16-19H,1-2H3
49 atoms
Br 3.943811 -1.660088 -0.953426
Br 3.173796 -0.324148 2.144932
Br 0.708827 -2.265268 2.32195
Br 3.58753 -3.434439 1.953742
O  -2.374733 -0.815371 -0.042807
O  -0.988987 0.937296 0.078674
O  -4.758849 4.432238 -0.917562
N  -5.263916 -1.666739 1.289729
C  0.687085 -0.876054 -1.916977
C  1.274094 -0.869454 -0.541757
C  -0.1901 -1.177549 -0.715831
C  2.221924 -1.928061 -0.059424
C  0.922338 -2.038988 -2.852757
C  0.585897 0.44612 -2.63724
C  -1.181417 -0.214496 -0.192177
C  2.42698 -1.965723 1.464255
C  -3.432291 -0.003547 0.448571
C  -3.988941 0.921485 -0.606526
C  -4.453858 -0.944904 0.913574
C  -4.106455 2.271033 -0.329683
C  -4.376647 0.419084 -1.84365
C  -4.632474 3.132091 -1.285994
C  -4.884014 1.287809 -2.793251
C  -5.019268 2.643255 -2.526815
C  -4.851531 5.400284 -1.8820
C  -3.77479 5.668128 -2.716166
C  -6.02093 6.137383 -1.971851
C  -3.8771 6.689451 -3.646974
C  -6.109126 7.16141 -2.904269
C  -5.041979 7.438272 -3.74476
H  1.481061 0.124043 -0.156331
H  -0.494032 -2.214913 -0.631519
H  1.883992 -2.924256 -0.355912
H  0.106663 -2.102657 -3.574341
H  1.850732 -1.907958 -3.408561
H  0.973924 -3.001577 -2.343796
H  -0.24051 0.435291 -3.349862
H  0.43751 1.286695 -1.964129
H  1.505598 0.624404 -3.196045
H  -3.096524 0.582495 1.310718
H  -3.786363 2.672008 0.623826
H  -4.290569 -0.637364 -2.062229
H  -5.192892 0.908302 -3.758024
H  -5.428635 3.30356 -3.279634
H  -2.864655 5.088182 -2.629805
H  -6.847353 5.914199 -1.309978
H  -3.038229 6.905371 -4.295139
H  -7.019364 7.741971 -2.9735
H  -5.114458 8.237244 -4.470121
nucrepener: 5435.25773911 hartree
twoeener: 9838.76095690 hartree
xcener: -389.811527353765 hartree
chargesum: 0.0000000
charge: -0.059983 0.001043 -0.005279 0.008881 -0.259996 -0.360501 -0.294091 0.000352 0.074847 -0.075694 -0.161814 -0.176092 -0.244350 -0.243397 0.348477 0.034162 0.305468 0.041694 -0.250922 -0.145854 -0.202024 0.198587 -0.118346 -0.141152 0.191113 -0.139584 -0.171212 -0.121649 -0.110287 -0.124235 0.121967 0.103259 0.148208 0.102572 0.099838 0.076272 0.090164 0.099937 0.095886 0.120720 0.106891 0.125001 0.129288 0.132641 0.135384 0.128279 0.128919 0.128506 0.128103
qa: -0.0600 0.0010 -0.0053 0.0089 -0.2600 -0.3605 -0.2941 0.0004 0.0748 -0.0757 -0.1618 -0.1761 -0.2443 -0.2434 0.3485 0.0342 0.3055 0.0417 -0.2509 -0.1459 -0.2020 0.1986 -0.1183 -0.1412 0.1911 -0.1396 -0.1712 -0.1216 -0.1103 -0.1242 0.1220 0.1033 0.1482 0.1026 0.0998 0.0763 0.0902 0.0999 0.0959 0.1207 0.1069 0.1250 0.1293 0.1326 0.1354 0.1283 0.1289 0.1285 0.1281
va: 1.2034 1.2344 1.2365 1.2414 2.1229 2.1497 2.1075 3.1202 3.8837 3.7070 3.9158 4.1155 3.9029 3.9058 4.2089 4.3556 3.8515 3.6571 4.0185 4.0663 4.0228 3.9234 3.9711 3.9215 3.8485 3.9765 4.0211 3.9433 3.9378 3.9433 1.0452 1.0282 1.0040 1.0050 1.0090 1.0081 1.0027 1.0212 1.0035 1.0184 1.0280 1.0184 1.0007 1.0067 1.0027 1.0110 0.9997 0.9991 0.9997
dispcorr: -0.028857309 hartree
energy: -11427.142787638239
dipole: -143.62466 143.87437 0.24971 98.85283 -98.00064 0.85218 -89.71283 87.91094 -1.80190
magnitude: 2.00883 au
magnitude: 5.10605 debye
