program: Orca
programVersion: 5.0.2
elementType: Br Br Br Br O O O N C C C C C C C C C C C C C C C C C C C C C C H H H H H H H H H H H H H H H H H H H
charge: 0
multiplicity: 1
keywords: wb97x-d3
keywords: def2-TZVPP
keywords: def2/J RIJCOSX
keywords: DEFGRID2
keywords: scfconv7
keywords: smallprint printgap noloewdin
keywords: NOSOSCF
formula: C22H19Br4NO3
InChI: InChI=1/C22H19Br4NO3/c1-21(2)17(19(23)22(24,25)26)18(21)20(28)30-16(12-27)13-7-6-10-15(11-13)29-14-8-4-3-5-9-14/h3-11,16-19H,1-2H3
49 atoms
Br 3.617935 -1.39025 -1.483358
Br 3.256841 0.877477 1.115008
Br 1.156756 -1.042991 2.436297
Br 4.047797 -2.079385 1.841358
O  -2.471853 -0.691911 0.499633
O  -1.342614 1.073847 -0.290569
O  -5.382501 2.880212 -2.770165
N  -4.671843 -0.996848 2.942467
C  0.156091 -1.186887 -1.903428
C  0.985582 -0.677923 -0.768664
C  -0.429057 -1.125307 -0.503819
C  2.142027 -1.444014 -0.196629
C  0.367791 -2.577999 -2.45431
C  -0.259258 -0.194185 -2.961968
C  -1.426399 -0.10955 -0.108785
C  2.629982 -0.944293 1.173342
C  -3.544477 0.162781 0.891031
C  -4.520155 0.367431 -0.242169
C  -4.170595 -0.496019 2.03879
C  -4.484984 1.564931 -0.946965
C  -5.402191 -0.641208 -0.60223
C  -5.351877 1.753282 -2.016064
C  -6.256645 -0.441691 -1.675598
C  -6.2396 0.747412 -2.38173
C  -4.661005 3.979202 -2.381945
C  -3.521043 4.311469 -3.094977
C  -5.094701 4.765183 -1.32395
C  -2.811267 5.452214 -2.74904
C  -4.373055 5.898576 -0.982554
C  -3.231514 6.24504 -1.692098
H  1.122053 0.39894 -0.772231
H  -0.565666 -2.091082 -0.030866
H  1.893231 -2.50144 -0.076052
H  1.155065 -2.580133 -3.208192
H  0.63617 -3.309776 -1.69236
H  -0.54955 -2.930732 -2.927544
H  0.498947 -0.163621 -3.745773
H  -1.202519 -0.492745 -3.422135
H  -0.378485 0.814806 -2.575379
H  -3.157737 1.12876 1.229548
H  -3.774351 2.331561 -0.667974
H  -5.435866 -1.569775 -0.046968
H  -6.952433 -1.2191 -1.961025
H  -6.909879 0.908196 -3.215767
H  -3.20133 3.685433 -3.917545
H  -5.990534 4.494804 -0.77948
H  -1.923657 5.718063 -3.307374
H  -4.708548 6.515892 -0.159899
H  -2.674584 7.132387 -1.42351
nucrepener: 5548.47935810 hartree
twoeener: 9952.10109715 hartree
xcener: -389.811689464131 hartree
chargesum: -0.0000000
charge: -0.060803 0.000654 -0.004494 0.008312 -0.251363 -0.380666 -0.293302 -0.002151 0.076828 -0.071937 -0.174589 -0.179497 -0.245794 -0.249459 0.385205 0.035456 0.309014 -0.025082 -0.257686 -0.132065 -0.182658 0.242549 -0.088371 -0.204482 0.206030 -0.153569 -0.158729 -0.113832 -0.122113 -0.117572 0.121417 0.102507 0.149880 0.100363 0.075712 0.103770 0.095636 0.093891 0.098482 0.120884 0.127040 0.119879 0.128746 0.127608 0.123568 0.131778 0.126800 0.129722 0.128482
qa: -0.0608 0.0007 -0.0045 0.0083 -0.2514 -0.3807 -0.2933 -0.0022 0.0768 -0.0719 -0.1746 -0.1795 -0.2458 -0.2495 0.3852 0.0355 0.3090 -0.0251 -0.2577 -0.1321 -0.1827 0.2425 -0.0884 -0.2045 0.2060 -0.1536 -0.1587 -0.1138 -0.1221 -0.1176 0.1214 0.1025 0.1499 0.1004 0.0757 0.1038 0.0956 0.0939 0.0985 0.1209 0.1270 0.1199 0.1287 0.1276 0.1236 0.1318 0.1268 0.1297 0.1285
va: 1.2024 1.2345 1.2370 1.2407 2.1290 2.1210 2.1190 3.1185 3.8805 3.6947 3.9392 4.1159 3.9024 3.9090 4.1741 4.3551 3.8378 3.7215 4.0240 3.8829 4.0519 3.8691 3.9483 4.0419 3.8373 4.0263 3.9885 3.9493 3.9472 3.9450 1.0451 1.0281 1.0024 1.0084 1.0083 1.0050 1.0037 1.0012 1.0204 1.0192 1.0299 1.0166 0.9995 1.0134 1.0108 1.0049 0.9998 0.9994 0.9996
dispcorr: -0.029377743 hartree
energy: -11427.144248500676
dipole: -151.96468 152.00444 0.03976 51.06904 -50.79114 0.27790 -67.55604 66.09269 -1.46335
magnitude: 1.49004 au
magnitude: 3.78737 debye
