program: Orca
programVersion: 5.0.2
elementType: Br Br Br Br O O O N C C C C C C C C C C C C C C C C C C C C C C H H H H H H H H H H H H H H H H H H H
charge: 0
multiplicity: 1
keywords: wb97x-d3
keywords: def2-TZVPP
keywords: def2/J RIJCOSX
keywords: DEFGRID2
keywords: scfconv7
keywords: smallprint printgap noloewdin
keywords: NOSOSCF
formula: C22H19Br4NO3
InChI: InChI=1/C22H19Br4NO3/c1-21(2)17(19(23)22(24,25)26)18(21)20(28)30-16(12-27)13-7-6-10-15(11-13)29-14-8-4-3-5-9-14/h3-11,16-19H,1-2H3
49 atoms
Br 3.561589 -2.458081 -0.988134
Br 3.453321 0.652622 0.523627
Br 1.259402 -0.428665 2.494295
Br 4.042803 -1.8421 2.349327
O  -2.306397 -0.478886 0.704437
O  -1.162167 0.678967 -0.830196
O  -5.563243 2.848358 -2.866837
N  -4.396524 0.312545 3.137579
C  0.098559 -2.15811 -1.434703
C  1.014246 -1.320941 -0.601965
C  -0.419853 -1.500524 -0.169341
C  2.128349 -1.896208 0.221877
C  0.1796 -3.666695 -1.390146
C  -0.283619 -1.630591 -2.795715
C  -1.300745 -0.314056 -0.172732
C  2.694731 -0.945017 1.289856
C  -3.222757 0.600964 0.820839
C  -4.245438 0.608811 -0.28866
C  -3.871544 0.424978 2.122409
C  -4.404118 1.752289 -1.055049
C  -5.016945 -0.52033 -0.529183
C  -5.364509 1.774993 -2.059825
C  -5.954959 -0.492209 -1.547697
C  -6.139066 0.649923 -2.309463
C  -5.25375 4.104442 -2.419285
C  -4.398826 4.877182 -3.188195
C  -5.821595 4.614368 -1.258792
C  -4.113822 6.176018 -2.79307
C  -5.520702 5.909755 -0.869836
C  -4.668683 6.695293 -1.63368
H  1.233529 -0.348813 -1.032589
H  -0.606096 -2.186951 0.648662
H  1.806945 -2.801389 0.743034
H  -0.780948 -4.097131 -1.676364
H  0.931843 -4.034504 -2.087995
H  0.423735 -4.05816 -0.402564
H  -1.263964 -2.00583 -3.093716
H  -0.313959 -0.544894 -2.838003
H  0.442494 -1.973734 -3.533994
H  -2.6890 1.556873 0.83808
H  -3.77456 2.614785 -0.876296
H  -4.895442 -1.40943 0.075971
H  -6.563752 -1.364619 -1.743062
H  -6.879508 0.678011 -3.097823
H  -3.9675 4.46234 -4.089599
H  -6.495808 4.007249 -0.667949
H  -3.448961 6.781092 -3.39489
H  -5.963066 6.309129 0.033091
H  -4.441784 7.707323 -1.327275
nucrepener: 5494.62267656 hartree
twoeener: 9898.19015421 hartree
xcener: -389.812931658482 hartree
chargesum: 0.0000000
charge: -0.059396 0.001362 -0.005107 0.008208 -0.260713 -0.367049 -0.295704 0.000058 0.078469 -0.082226 -0.164729 -0.174378 -0.243394 -0.243595 0.358609 0.034297 0.310471 0.011635 -0.253152 -0.104533 -0.201041 0.207045 -0.090572 -0.193121 0.218689 -0.185704 -0.159498 -0.099209 -0.115311 -0.133331 0.122872 0.103024 0.149269 0.102666 0.100399 0.075350 0.091165 0.101101 0.094302 0.118031 0.116541 0.123966 0.128816 0.129294 0.126117 0.135674 0.126624 0.129844 0.127867
qa: -0.0594 0.0014 -0.0051 0.0082 -0.2607 -0.3670 -0.2957 0.0001 0.0785 -0.0822 -0.1647 -0.1744 -0.2434 -0.2436 0.3586 0.0343 0.3105 0.0116 -0.2532 -0.1045 -0.2010 0.2070 -0.0906 -0.1931 0.2187 -0.1857 -0.1595 -0.0992 -0.1153 -0.1333 0.1229 0.1030 0.1493 0.1027 0.1004 0.0754 0.0912 0.1011 0.0943 0.1180 0.1165 0.1240 0.1288 0.1293 0.1261 0.1357 0.1266 0.1298 0.1279
va: 1.2036 1.2354 1.2394 1.2410 2.1230 2.1427 2.1132 3.1206 3.8784 3.7104 3.9274 4.1113 3.9038 3.9067 4.1895 4.3533 3.8552 3.6670 4.0176 3.9139 4.0320 3.8819 3.9478 4.0307 3.8260 4.0380 3.9671 3.9343 3.9448 3.9532 1.0443 1.0282 1.0030 1.0052 1.0086 1.0084 1.0024 1.0212 1.0032 1.0215 1.0203 1.0174 0.9991 1.0117 1.0127 1.0027 0.9993 0.9994 0.9998
dispcorr: -0.028982148 hartree
energy: -11427.143243940731
dipole: -159.91602 159.78552 -0.13051 47.24935 -47.49403 -0.24468 -64.96682 63.74944 -1.21738
magnitude: 1.24856 au
magnitude: 3.17360 debye
