program: Orca
programVersion: 5.0.2
elementType: Br Br Br Br O O O N C C C C C C C C C C C C C C C C C C C C C C H H H H H H H H H H H H H H H H H H H
charge: 0
multiplicity: 1
keywords: wb97x-d3
keywords: def2-TZVPP
keywords: def2/J RIJCOSX
keywords: DEFGRID2
keywords: scfconv7
keywords: smallprint printgap noloewdin
keywords: NOSOSCF
formula: C22H19Br4NO3
InChI: InChI=1/C22H19Br4NO3/c1-21(2)17(19(23)22(24,25)26)18(21)20(28)30-16(12-27)13-7-6-10-15(11-13)29-14-8-4-3-5-9-14/h3-11,16-19H,1-2H3
49 atoms
Br 3.559506 -2.572409 -0.956772
Br 3.534457 0.511309 0.614836
Br 1.318417 -0.55821 2.571519
Br 4.065459 -2.035326 2.389405
O  -2.313566 -0.471402 0.655062
O  -1.03599 0.712351 -0.748309
O  -5.109467 3.054217 -3.127511
N  -4.71937 0.212868 2.810183
C  0.109842 -2.167595 -1.39355
C  1.049007 -1.370075 -0.546998
C  -0.389849 -1.506073 -0.121416
C  2.144197 -1.994268 0.266623
C  0.138916 -3.678337 -1.366661
C  -0.251123 -1.609888 -2.748386
C  -1.240057 -0.298005 -0.136675
C  2.738894 -1.081849 1.352173
C  -3.241104 0.603271 0.691164
C  -4.09422 0.663251 -0.553274
C  -4.064131 0.369249 1.880094
C  -4.197574 1.857716 -1.245958
C  -4.75912 -0.473209 -0.996848
C  -4.99275 1.923467 -2.384227
C  -5.528055 -0.4008 -2.146213
C  -5.655517 0.792702 -2.83918
C  -5.134478 4.27821 -2.518346
C  -5.897998 4.519499 -1.382739
C  -4.411014 5.300763 -3.112859
C  -5.924482 5.79572 -0.842494
C  -4.456634 6.575183 -2.568347
C  -5.207965 6.828067 -1.430572
H  1.301254 -0.400788 -0.96572
H  -0.608985 -2.194618 0.686596
H  1.795697 -2.899869 0.769387
H  0.879335 -4.063856 -2.067642
H  0.367581 -4.0891 -0.383251
H  -0.835339 -4.072427 -1.659017
H  -0.238099 -0.523319 -2.778374
H  0.461481 -1.97192 -3.490743
H  -1.24552 -1.941974 -3.051451
H  -2.719901 1.556968 0.826381
H  -3.650795 2.729848 -0.909259
H  -4.681555 -1.404773 -0.451377
H  -6.048238 -1.279742 -2.50241
H  -6.262886 0.854991 -3.732357
H  -6.471952 3.723403 -0.925738
H  -3.823621 5.094766 -3.99784
H  -6.518949 5.983353 0.041799
H  -3.893903 7.372566 -3.035343
H  -5.237551 7.822107 -1.005744
nucrepener: 5480.95129946 hartree
twoeener: 9884.44105528 hartree
xcener: -389.812915145023 hartree
chargesum: -0.0000000
charge: -0.059648 0.002209 -0.006292 0.008416 -0.260530 -0.360910 -0.297543 0.000857 0.076672 -0.079149 -0.161772 -0.175566 -0.244599 -0.242202 0.349700 0.033994 0.309865 0.036312 -0.253414 -0.118510 -0.207292 0.205923 -0.091546 -0.190965 0.238354 -0.165581 -0.207087 -0.114791 -0.089801 -0.143704 0.123001 0.103734 0.149804 0.100637 0.075880 0.102083 0.101427 0.094972 0.089732 0.119137 0.116537 0.124706 0.129375 0.130161 0.136517 0.126873 0.130304 0.126530 0.127188
qa: -0.0596 0.0022 -0.0063 0.0084 -0.2605 -0.3609 -0.2975 0.0009 0.0767 -0.0791 -0.1618 -0.1756 -0.2446 -0.2422 0.3497 0.0340 0.3099 0.0363 -0.2534 -0.1185 -0.2073 0.2059 -0.0915 -0.1910 0.2384 -0.1656 -0.2071 -0.1148 -0.0898 -0.1437 0.1230 0.1037 0.1498 0.1006 0.0759 0.1021 0.1014 0.0950 0.0897 0.1191 0.1165 0.1247 0.1294 0.1302 0.1365 0.1269 0.1303 0.1265 0.1272
va: 1.2036 1.2361 1.2374 1.2410 2.1229 2.1489 2.1134 3.1205 3.8836 3.7098 3.9178 4.1118 3.9025 3.9068 4.2031 4.3542 3.8535 3.6338 4.0186 3.9440 4.0253 3.8838 3.9403 4.0353 3.8084 3.9451 4.0417 3.9480 3.9326 3.9626 1.0446 1.0276 1.0027 1.0085 1.0083 1.0052 1.0208 1.0036 1.0030 1.0205 1.0174 1.0181 0.9989 1.0109 1.0027 1.0134 0.9994 0.9988 1.0000
dispcorr: -0.029100652 hartree
energy: -11427.143052561609
dipole: -160.85941 160.76087 -0.09854 52.74111 -53.01060 -0.26950 -68.67981 67.53403 -1.14578
magnitude: 1.18116 au
magnitude: 3.00227 debye
