program: Orca
programVersion: 5.0.2
elementType: Br Br Br Br O O O N C C C C C C C C C C C C C C C C C C C C C C H H H H H H H H H H H H H H H H H H H
charge: 0
multiplicity: 1
keywords: wb97x-d3
keywords: def2-TZVPP
keywords: def2/J RIJCOSX
keywords: DEFGRID2
keywords: scfconv7
keywords: smallprint printgap noloewdin
keywords: NOSOSCF
formula: C22H19Br4NO3
InChI: InChI=1/C22H19Br4NO3/c1-21(2)17(19(23)22(24,25)26)18(21)20(28)30-16(12-27)13-7-6-10-15(11-13)29-14-8-4-3-5-9-14/h3-11,16-19H,1-2H3
49 atoms
Br 3.58289 -0.810882 2.031668
Br 2.246321 -3.574062 0.441721
Br 1.467911 -1.744969 -1.991342
Br 4.454547 -1.931845 -1.083554
O  -1.975053 0.521539 -0.981839
O  -1.895514 -1.060829 0.599021
O  -4.801007 4.42213 1.063277
N  -4.002562 1.09376 -3.543715
C  0.504787 0.761348 1.560504
C  0.992749 -0.520735 0.96359
C  0.014747 0.323071 0.190822
C  2.401387 -0.690104 0.473767
C  1.381271 1.99283 1.571844
C  -0.395032 0.671987 2.769294
C  -1.361137 -0.176251 -0.009204
C  2.630096 -1.904337 -0.440874
C  -3.365318 0.271722 -1.147186
C  -4.179016 1.004889 -0.108323
C  -3.700417 0.735027 -2.495437
C  -4.09534 2.391732 -0.043225
C  -4.974224 0.300046 0.778757
C  -4.838999 3.074972 0.907093
C  -5.707266 0.994813 1.731353
C  -5.648877 2.373879 1.796515
C  -4.43346 5.24363 0.03261
C  -5.004753 5.140776 -1.229382
C  -3.506939 6.236786 0.31018
C  -4.629375 6.037455 -2.217221
C  -3.150496 7.135697 -0.683763
C  -3.703808 7.036488 -1.95114
H  0.56481 -1.411383 1.413258
H  0.400899 0.910163 -0.634629
H  2.73224 0.189838 -0.083587
H  2.033448 1.996888 2.445178
H  2.010551 2.085627 0.686691
H  0.758788 2.887467 1.614978
H  0.214891 0.66559 3.673619
H  -1.05882 1.536593 2.820543
H  -1.010643 -0.223937 2.778867
H  -3.575778 -0.801156 -1.09673
H  -3.459493 2.929717 -0.736031
H  -5.015268 -0.77997 0.735946
H  -6.332772 0.454771 2.429109
H  -6.223045 2.919961 2.533311
H  -5.735293 4.370979 -1.442919
H  -3.079214 6.306352 1.301694
H  -5.070523 5.954288 -3.201408
H  -2.430786 7.913192 -0.464336
H  -3.419235 7.734739 -2.726374
nucrepener: 5513.88103371 hartree
twoeener: 9917.44101367 hartree
xcener: -389.812109038554 hartree
chargesum: -0.0000000
charge: -0.060253 0.001834 -0.006192 0.007630 -0.263629 -0.363840 -0.294304 -0.002153 0.073626 -0.063343 -0.167179 -0.185112 -0.245984 -0.244242 0.353496 0.036081 0.338371 0.019985 -0.265291 -0.224404 -0.144799 0.252516 -0.079881 -0.215064 0.268250 -0.193051 -0.217169 -0.098574 -0.088659 -0.144991 0.121196 0.103257 0.150210 0.100504 0.075858 0.103245 0.096077 0.092154 0.099860 0.122588 0.131351 0.113857 0.128751 0.129301 0.137206 0.124753 0.132314 0.126191 0.127652
qa: -0.0603 0.0018 -0.0062 0.0076 -0.2636 -0.3638 -0.2943 -0.0022 0.0736 -0.0633 -0.1672 -0.1851 -0.2460 -0.2442 0.3535 0.0361 0.3384 0.0200 -0.2653 -0.2244 -0.1448 0.2525 -0.0799 -0.2151 0.2683 -0.1931 -0.2172 -0.0986 -0.0887 -0.1450 0.1212 0.1033 0.1502 0.1005 0.0759 0.1032 0.0961 0.0922 0.0999 0.1226 0.1314 0.1139 0.1288 0.1293 0.1372 0.1248 0.1323 0.1262 0.1277
va: 1.2034 1.2358 1.2356 1.2401 2.1263 2.1426 2.1224 3.1190 3.8898 3.6981 3.9199 4.1211 3.9009 3.9049 4.2172 4.3548 3.8253 3.6611 4.0288 3.9701 4.0050 3.8358 3.9478 4.0389 3.7693 3.9712 4.0503 3.9411 3.9271 3.9654 1.0443 1.0280 1.0029 1.0085 1.0083 1.0053 1.0037 1.0021 1.0210 1.0190 1.0203 1.0174 0.9994 1.0124 1.0028 1.0139 0.9989 0.9989 1.0002
dispcorr: -0.029527640 hartree
energy: -11427.144110599646
dipole: -143.22939 143.24366 0.01427 119.50430 -118.65465 0.84965 15.67540 -14.65311 1.02229
magnitude: 1.32936 au
magnitude: 3.37896 debye
