program: Orca
programVersion: 5.0.2
elementType: Br Br Br Br O O O N C C C C C C C C C C C C C C C C C C C C C C H H H H H H H H H H H H H H H H H H H
charge: 0
multiplicity: 1
keywords: wb97x-d3
keywords: def2-TZVPP
keywords: def2/J RIJCOSX
keywords: DEFGRID2
keywords: scfconv7
keywords: smallprint printgap noloewdin
keywords: NOSOSCF
formula: C22H19Br4NO3
InChI: InChI=1/C22H19Br4NO3/c1-21(2)17(19(23)22(24,25)26)18(21)20(28)30-16(12-27)13-7-6-10-15(11-13)29-14-8-4-3-5-9-14/h3-11,16-19H,1-2H3
49 atoms
Br 3.673369 0.11998 1.227005
Br 2.33995 -3.085691 1.103292
Br 0.865376 -2.309042 -1.560678
Br 3.979336 -2.074735 -1.382415
O  -2.429739 -0.190907 -0.715559
O  -1.959921 -0.767635 1.396289
O  -5.279011 3.931482 0.098443
N  -4.594379 -1.326582 -2.945424
C  0.393838 1.284878 1.032318
C  0.901972 -0.101746 0.808349
C  -0.322863 0.36518 0.060828
C  2.176762 -0.392423 0.071967
C  1.07333 2.47806 0.401594
C  -0.187821 1.591383 2.389927
C  -1.625324 -0.260021 0.363609
C  2.340456 -1.853354 -0.379054
C  -3.746554 -0.686187 -0.557692
C  -4.675959 0.330647 0.067129
C  -4.206101 -1.036055 -1.904358
C  -4.500059 1.682353 -0.186592
C  -5.736002 -0.105045 0.848978
C  -5.393103 2.597859 0.353561
C  -6.631442 0.817716 1.365254
C  -6.46277 2.171974 1.12695
C  -4.064582 4.535812 0.25824
C  -3.261625 4.28161 1.363469
C  -3.676947 5.464237 -0.6967
C  -2.068617 4.972695 1.50756
C  -2.480618 6.147162 -0.539444
C  -1.669779 5.903458 0.559101
H  0.695033 -0.781821 1.628585
H  -0.189826 0.625739 -0.982911
H  2.265436 0.228289 -0.823232
H  1.894071 2.831976 1.02574
H  1.47629 2.27243 -0.590239
H  0.355621 3.293215 0.292949
H  -0.944807 2.373181 2.315251
H  -0.64378 0.726403 2.86362
H  0.605118 1.952568 3.046428
H  -3.747656 -1.599641 0.046744
H  -3.683077 2.028619 -0.807273
H  -5.865514 -1.160233 1.053514
H  -7.460499 0.481563 1.972962
H  -7.152496 2.899643 1.533322
H  -3.570694 3.563687 2.112848
H  -4.316404 5.651318 -1.549267
H  -1.450965 4.788785 2.37711
H  -2.181465 6.872577 -1.284297
H  -0.739592 6.44159 0.681234
nucrepener: 5624.12516296 hartree
xcener: -389.813010577785 hartree
chargesum: 0.0000000
charge: -0.060291 0.001411 -0.003637 0.009353 -0.274081 -0.362165 -0.299956 0.003165 0.108327 -0.086978 -0.167271 -0.175290 -0.246038 -0.240455 0.346015 0.033758 0.302132 0.070402 -0.252234 -0.126041 -0.165823 0.150085 -0.093107 -0.181367 0.199946 -0.106056 -0.191175 -0.186832 -0.091495 -0.137847 0.122303 0.102758 0.150375 0.099246 0.075990 0.102050 0.060609 0.105910 0.099006 0.128904 0.132853 0.109388 0.129863 0.132395 0.138077 0.130452 0.142887 0.128609 0.131869
qa: -0.0603 0.0014 -0.0036 0.0094 -0.2741 -0.3622 -0.3000 0.0032 0.1083 -0.0870 -0.1673 -0.1753 -0.2460 -0.2405 0.3460 0.0338 0.3021 0.0704 -0.2522 -0.1260 -0.1658 0.1501 -0.0931 -0.1814 0.1999 -0.1061 -0.1912 -0.1868 -0.0915 -0.1378 0.1223 0.1028 0.1504 0.0992 0.0760 0.1021 0.0606 0.1059 0.0990 0.1289 0.1329 0.1094 0.1299 0.1324 0.1381 0.1305 0.1429 0.1286 0.1319
va: 1.2031 1.2355 1.2394 1.2423 2.0993 2.1437 2.1026 3.1213 3.8360 3.7448 3.9325 4.1125 3.9094 3.8999 4.1929 4.3552 3.8348 3.6716 4.0082 3.9330 4.0454 3.8961 3.9511 4.0356 3.8539 3.8596 4.0242 3.9212 3.9447 3.9186 1.0435 1.0294 1.0018 1.0082 1.0109 1.0096 1.0217 1.0261 1.0039 1.0226 1.0215 1.0117 0.9993 1.0093 1.0031 1.0120 0.9908 0.9976 0.9988
dispcorr: -0.031774220 hartree
energy: -11427.145080478431
dipole: -134.45085 134.67273 0.22188 108.16014 -106.87250 1.28764 20.75247 -19.71566 1.03680
magnitude: 1.66799 au
magnitude: 4.23971 debye
