program: Orca
programVersion: 5.0.2
elementType: Br Br Br Br O O O N C C C C C C C C C C C C C C C C C C C C C C H H H H H H H H H H H H H H H H H H H
charge: 0
multiplicity: 1
keywords: wb97x-d3
keywords: def2-TZVPP
keywords: def2/J RIJCOSX
keywords: DEFGRID2
keywords: scfconv7
keywords: smallprint printgap noloewdin
keywords: NOSOSCF
formula: C22H19Br4NO3
InChI: InChI=1/C22H19Br4NO3/c1-21(2)17(19(23)22(24,25)26)18(21)20(28)30-16(12-27)13-7-6-10-15(11-13)29-14-8-4-3-5-9-14/h3-11,16-19H,1-2H3
49 atoms
Br 3.716407 0.514938 -0.750331
Br 2.834977 -0.794189 2.342484
Br 0.947924 -2.836522 0.881289
Br 3.992118 -2.766253 0.180766
O  -2.595682 -0.73355 -0.226441
O  -1.552494 0.60418 1.243323
O  -5.063899 3.425802 -1.823298
N  -4.562194 -3.177431 0.821695
C  0.305399 0.998581 -1.301348
C  0.973996 0.216625 -0.216669
C  -0.392008 -0.203713 -0.686673
C  2.170314 -0.653829 -0.464593
C  0.723072 0.83437 -2.74416
C  -0.142962 2.40168 -0.975358
C  -1.532594 -0.048364 0.237298
C  2.478432 -1.659879 0.657478
C  -3.793491 -0.696852 0.532633
C  -4.837567 0.181596 -0.127631
C  -4.228361 -2.087827 0.67996
C  -4.435586 1.393409 -0.679741
C  -6.17816 -0.171936 -0.124961
C  -5.382887 2.249903 -1.221783
C  -7.114583 0.693708 -0.673458
C  -6.72904 1.9036 -1.217484
C  -3.929714 4.112115 -1.492528
C  -3.165916 4.616126 -2.535441
C  -3.578047 4.36821 -0.172865
C  -2.048163 5.387824 -2.254465
C  -2.450296 5.129069 0.09338
C  -1.682462 5.643476 -0.941591
H  0.981928 0.718312 0.745791
H  -0.460093 -1.066886 -1.338896
H  2.056937 -1.231304 -1.385523
H  1.556891 1.494762 -2.982562
H  1.022886 -0.182904 -2.995872
H  -0.108203 1.094818 -3.400744
H  -0.415151 2.533121 0.069002
H  0.665546 3.100641 -1.193787
H  -0.999592 2.69399 -1.585777
H  -3.585624 -0.30808 1.535874
H  -3.393318 1.681527 -0.691489
H  -6.502665 -1.115107 0.29412
H  -8.160314 0.417779 -0.67418
H  -7.456094 2.579838 -1.646734
H  -3.458283 4.412927 -3.557328
H  -4.179502 3.983993 0.640901
H  -1.458417 5.785651 -3.069713
H  -2.177055 5.326555 1.121379
H  -0.807499 6.241074 -0.725034
nucrepener: 5631.86034006 hartree
xcener: -389.814278590030 hartree
chargesum: 0.0000000
charge: -0.060975 0.001238 -0.003036 0.007995 -0.258141 -0.355313 -0.292228 -0.001550 0.123535 -0.079446 -0.164365 -0.179785 -0.250745 -0.273155 0.317971 0.035196 0.358138 -0.041343 -0.257563 -0.151774 -0.185665 0.257311 -0.074014 -0.211912 0.244662 -0.198136 -0.165156 -0.105566 -0.119648 -0.136407 0.123394 0.104188 0.150250 0.100880 0.077421 0.105424 0.106975 0.102827 0.071318 0.131325 0.113182 0.127559 0.129989 0.128248 0.125651 0.135382 0.126528 0.131028 0.128308
qa: -0.0610 0.0012 -0.0030 0.0080 -0.2581 -0.3553 -0.2922 -0.0016 0.1235 -0.0794 -0.1644 -0.1798 -0.2507 -0.2732 0.3180 0.0352 0.3581 -0.0413 -0.2576 -0.1518 -0.1857 0.2573 -0.0740 -0.2119 0.2447 -0.1981 -0.1652 -0.1056 -0.1196 -0.1364 0.1234 0.1042 0.1503 0.1009 0.0774 0.1054 0.1070 0.1028 0.0713 0.1313 0.1132 0.1276 0.1300 0.1282 0.1257 0.1354 0.1265 0.1310 0.1283
va: 1.2037 1.2350 1.2380 1.2409 2.1139 2.1481 2.1262 3.1124 3.8556 3.7200 3.9336 4.1155 3.9013 3.8977 4.2403 4.3531 3.7903 3.8852 4.0255 3.9441 4.0045 3.8325 3.9693 4.0335 3.7945 3.9914 3.9377 3.9019 3.8958 3.8983 1.0441 1.0298 1.0025 1.0081 1.0091 1.0038 1.0144 1.0079 1.0029 1.0209 0.9937 1.0220 0.9997 1.0138 1.0146 1.0019 1.0002 0.9999 1.0008
dispcorr: -0.032457932 hartree
energy: -11427.146149546246
dipole: -141.18315 141.14902 -0.03413 90.22722 -88.66401 1.56321 -44.14768 43.24974 -0.89793
magnitude: 1.80308 au
magnitude: 4.58305 debye
