program: Orca
programVersion: 5.0.2
elementType: Br Br Br Br O O O N C C C C C C C C C C C C C C C C C C C C C C H H H H H H H H H H H H H H H H H H H
charge: 0
multiplicity: 1
keywords: wb97x-d3
keywords: def2-TZVPP
keywords: def2/J RIJCOSX
keywords: DEFGRID2
keywords: scfconv7
keywords: smallprint printgap noloewdin
keywords: NOSOSCF
formula: C22H19Br4NO3
InChI: InChI=1/C22H19Br4NO3/c1-21(2)17(19(23)22(24,25)26)18(21)20(28)30-16(12-27)13-7-6-10-15(11-13)29-14-8-4-3-5-9-14/h3-11,16-19H,1-2H3
49 atoms
Br 3.664473 -1.089925 -0.804831
Br 0.941947 1.077365 -1.147874
Br 0.130747 0.401244 1.807855
Br 2.968131 1.569787 1.20459
O  -1.628043 -2.459133 -0.54563
O  -1.98816 -3.379521 1.459243
O  -3.208723 2.245647 0.823063
N  -3.342623 -2.013366 -3.330413
C  1.288787 -3.523363 0.041113
C  1.1203 -2.042292 -0.091067
C  0.232984 -2.80296 0.857253
C  2.128062 -1.051383 0.410169
C  2.439837 -4.100518 0.831081
C  0.906589 -4.37106 -1.148158
C  -1.228738 -2.92679 0.652214
C  1.594706 0.3864 0.527801
C  -3.028443 -2.40893 -0.76641
C  -3.689187 -1.29457 0.010724
C  -3.186967 -2.190612 -2.206436
C  -3.113904 -0.029837 0.004709
C  -4.856186 -1.542121 0.712558
C  -3.725979 0.996714 0.709746
C  -5.46299 -0.505912 1.406732
C  -4.906806 0.759524 1.406818
C  -2.413279 2.805729 -0.135056
C  -2.631118 2.635064 -1.49585
C  -1.39844 3.638088 0.317252
C  -1.811278 3.295073 -2.40013
C  -0.601203 4.305376 -0.596947
C  -0.798067 4.133378 -1.959284
H  0.651105 -1.741955 -1.020992
H  0.465993 -2.742862 1.914477
H  2.51416 -1.331486 1.393495
H  2.703331 -3.506765 1.706637
H  2.182221 -5.098442 1.188465
H  3.331337 -4.186994 0.209591
H  0.594587 -5.367157 -0.830189
H  0.103329 -3.937158 -1.739687
H  1.769397 -4.486237 -1.805418
H  -3.497904 -3.364925 -0.511475
H  -2.192566 0.147788 -0.535595
H  -5.28495 -2.535453 0.727884
H  -6.375057 -0.687725 1.958705
H  -5.371738 1.570285 1.951802
H  -3.432337 2.00326 -1.856735
H  -1.244216 3.759637 1.381127
H  -1.981142 3.158478 -3.459963
H  0.18873 4.952114 -0.239317
H  -0.168255 4.649337 -2.671245
nucrepener: 6109.43215673 hartree
xcener: -389.821494888506 hartree
chargesum: 0.0000000
charge: -0.062150 -0.005721 -0.015296 0.003474 -0.270265 -0.325500 -0.290314 0.000232 0.078471 -0.085890 -0.129730 -0.156230 -0.253303 -0.251422 0.316435 0.053994 0.279418 0.087711 -0.258087 -0.291458 -0.163604 0.330999 -0.070241 -0.232463 0.321632 -0.200945 -0.263698 -0.113959 -0.046062 -0.176374 0.123606 0.106432 0.151731 0.074699 0.104610 0.100388 0.097522 0.091337 0.096744 0.125989 0.109256 0.105189 0.127388 0.127538 0.140826 0.123686 0.132057 0.124700 0.126649
qa: -0.0622 -0.0057 -0.0153 0.0035 -0.2703 -0.3255 -0.2903 0.0002 0.0785 -0.0859 -0.1297 -0.1562 -0.2533 -0.2514 0.3164 0.0540 0.2794 0.0877 -0.2581 -0.2915 -0.1636 0.3310 -0.0702 -0.2325 0.3216 -0.2009 -0.2637 -0.1140 -0.0461 -0.1764 0.1236 0.1064 0.1517 0.0747 0.1046 0.1004 0.0975 0.0913 0.0967 0.1260 0.1093 0.1052 0.1274 0.1275 0.1408 0.1237 0.1321 0.1247 0.1266
va: 1.2022 1.2353 1.2229 1.2400 2.0949 2.1833 2.1214 3.1146 3.8773 3.6715 3.9010 4.0768 3.9145 3.9117 4.2549 4.3036 3.8615 3.6609 4.0112 3.9952 4.0419 3.7157 3.9360 4.0597 3.6950 3.9278 4.0029 3.9039 3.8625 3.9331 1.0342 1.0241 1.0026 1.0088 1.0044 1.0077 1.0012 1.0163 1.0051 1.0171 1.0311 1.0145 0.9997 1.0134 1.0030 1.0194 0.9999 0.9992 1.0018
dispcorr: -0.037117433 hartree
energy: -11427.148658577882
dipole: -84.43230 84.83351 0.40121 -36.36273 36.03243 -0.33031 -11.10424 11.92728 0.82304
magnitude: 0.97338 au
magnitude: 2.47413 debye
