program: Orca
programVersion: 5.0.2
elementType: O O O O N C C C C C C C C C C C C C C C C C C C H H H H H H H H H H H H H H H H H H H H H H H H H
charge: 0
multiplicity: 1
keywords: wb97x-d3
keywords: def2-TZVPP
keywords: def2/J RIJCOSX
keywords: DEFGRID2
keywords: scfconv7
keywords: smallprint printgap noloewdin
keywords: NOSOSCF
formula: C19H25NO4
InChI: InChI=1/C19H25NO4/c1-11(2)9-14-15(19(14,3)4)18(23)24-10-20-16(21)12-7-5-6-8-13(12)17(20)22/h9,14-15H,5-8,10H2,1-4H3
49 atoms
O  1.203742 -1.844811 -1.121964
O  1.326988 -1.345937 1.053333
O  -1.198192 -0.651111 -2.716061
O  -1.54084 -2.123718 1.572854
N  -1.101291 -1.672095 -0.652967
C  4.036034 0.007029 0.443996
C  3.024551 1.015738 0.02983
C  2.922514 -0.432335 -0.485085
C  5.391098 0.084136 -0.221023
C  4.121234 -0.476244 1.87119
C  2.005632 1.575669 0.94792
C  1.770805 -1.235275 -0.064391
C  0.875302 2.146181 0.521271
C  -0.007258 -2.55594 -0.913836
C  -0.115101 2.740073 1.472017
C  0.532372 2.228639 -0.939329
C  -2.518704 0.138009 -0.844542
C  -2.613094 -0.29748 0.412352
C  -3.263974 1.289842 -1.406874
C  -3.491812 0.283456 1.45463
C  -3.872374 2.106739 -0.265599
C  -4.511669 1.216101 0.799259
C  -1.550871 -0.723186 -1.564784
C  -1.708413 -1.460057 0.581479
H  3.338111 1.691973 -0.761613
H  3.203806 -0.569545 -1.52226
H  6.043984 0.770654 0.320995
H  5.874025 -0.894544 -0.234088
H  5.320394 0.43584 -1.250965
H  4.837742 0.142361 2.414599
H  3.182498 -0.439258 2.414974
H  4.486676 -1.503762 1.905593
H  2.206932 1.541659 2.013843
H  0.072105 -3.273337 -0.098217
H  -0.177374 -3.099782 -1.839261
H  0.223088 2.688007 2.506682
H  -0.313848 3.787239 1.229941
H  -1.076077 2.222379 1.403307
H  1.152443 2.970443 -1.449685
H  0.691989 1.280431 -1.455216
H  -0.506117 2.522976 -1.092545
H  -2.60352 1.907141 -2.020034
H  -4.044625 0.921579 -2.080015
H  -3.990439 -0.508677 2.017716
H  -2.875659 0.826977 2.178395
H  -3.089598 2.716129 0.195209
H  -4.612926 2.798888 -0.667568
H  -5.302595 0.615859 0.341073
H  -4.988103 1.830476 1.56387
elementType: O N C H
totalener: -1094.86590532 hartree
nucrepener: 2249.31918829 hartree
electener: -3344.18509361 hartree
oneelecener: -5961.29029090 hartree
twoeener: 2617.10519729 hartree
cpcmener: -0.04278266 hartree
kineticenergy: 1090.05274943 hartree
xcener: -105.979090940689 hartree
chargesum: -0.0000000
charge: -0.289961 -0.480030 -0.433141 -0.428764 -0.091132 0.134264 -0.024802 -0.103612 -0.266143 -0.292941 -0.273898 0.407682 -0.002145 0.080661 -0.213495 -0.300605 -0.079640 -0.057377 -0.084318 -0.088392 -0.155400 -0.118823 0.306391 0.330046 0.116295 0.095293 0.095509 0.096802 0.087964 0.098958 0.090316 0.102932 0.127693 0.132715 0.143329 0.094154 0.107632 0.061927 0.124919 0.094702 0.100528 0.098422 0.113041 0.102125 0.107744 0.086276 0.086883 0.078853 0.080564
qa: -0.2900 -0.4800 -0.4331 -0.4288 -0.0911 0.1343 -0.0248 -0.1036 -0.2661 -0.2929 -0.2739 0.4077 -0.0021 0.0807 -0.2135 -0.3006 -0.0796 -0.0574 -0.0843 -0.0884 -0.1554 -0.1188 0.3064 0.3300 0.1163 0.0953 0.0955 0.0968 0.0880 0.0990 0.0903 0.1029 0.1277 0.1327 0.1433 0.0942 0.1076 0.0619 0.1249 0.0947 0.1005 0.0984 0.1130 0.1021 0.1077 0.0863 0.0869 0.0789 0.0806
va: 2.1029 2.0083 2.0668 2.0790 3.0757 3.7765 3.8005 3.8333 3.8975 3.8883 3.8052 4.0874 3.6395 3.9103 3.9190 3.9580 3.6420 3.5940 3.9000 3.9165 3.9091 3.9012 4.1625 4.1877 1.0023 1.0315 1.0022 1.0022 1.0044 0.9993 1.0180 0.9998 1.0017 1.0147 0.9957 1.0133 0.9944 0.9952 0.9989 1.0050 1.0035 1.0100 1.0053 1.0158 0.9981 1.0049 1.0120 1.0070 1.0107
dispcorr: -0.029557393 hartree
energy: -1094.895462713195
dipole: 6.55965 -7.22555 -0.66590 20.34695 -18.77417 1.57278 5.67485 -6.30695 -0.63210
magnitude: 1.82115 au
magnitude: 4.62900 debye
