program: Orca
programVersion: 5.0.2
elementType: O O O O N C C C C C C C C C C C C C C C C C C C H H H H H H H H H H H H H H H H H H H H H H H H H
charge: 0
multiplicity: 1
keywords: wb97x-d3
keywords: def2-TZVPP
keywords: def2/J RIJCOSX
keywords: DEFGRID2
keywords: scfconv7
keywords: smallprint printgap noloewdin
keywords: NOSOSCF
formula: C19H25NO4
InChI: InChI=1/C19H25NO4/c1-11(2)9-14-15(19(14,3)4)18(23)24-10-20-16(21)12-7-5-6-8-13(12)17(20)22/h9,14-15H,5-8,10H2,1-4H3
49 atoms
O  1.200481 -2.060519 -0.550993
O  1.488999 -0.973105 1.379609
O  -1.320381 -1.576241 2.332665
O  -1.382714 -1.401151 -2.211698
N  -1.069204 -1.769815 0.040806
C  4.053319 0.252204 0.178625
C  2.966585 0.98318 -0.530807
C  2.954359 -0.556847 -0.474184
C  5.383808 0.166095 -0.534873
C  4.212073 0.339141 1.676947
C  1.930434 1.780089 0.168198
C  1.846757 -1.192129 0.247567
C  0.785069 2.171456 -0.398197
C  0.026051 -2.684091 -0.051687
C  -0.199228 3.026643 0.336084
C  0.404678 1.8127 -1.802247
C  -2.613896 -0.23528 0.794979
C  -2.642767 -0.186091 -0.537215
C  -3.471666 0.571962 1.695492
C  -3.522809 0.695058 -1.341661
C  -4.624641 1.17433 0.891622
C  -4.147198 1.758878 -0.436812
C  -1.607252 -1.242302 1.211151
C  -1.653875 -1.157564 -1.061897
H  3.221488 1.34295 -1.523151
H  3.21595 -1.047511 -1.404179
H  5.264236 0.10274 -1.616973
H  5.989001 1.04809 -0.318223
H  5.945419 -0.711172 -0.209239
H  4.669878 -0.572062 2.065309
H  4.881829 1.166993 1.916804
H  3.286499 0.501507 2.220188
H  2.132038 2.08668 1.189601
H  0.189054 -3.1423 0.922755
H  -0.202603 -3.467544 -0.769182
H  -0.389346 3.957556 -0.204745
H  -1.164826 2.520409 0.423484
H  0.142236 3.280911 1.339176
H  0.939557 0.943565 -2.182058
H  -0.664901 1.610355 -1.876626
H  0.604529 2.647244 -2.480265
H  -3.845169 -0.041862 2.518087
H  -2.867419 1.360752 2.15548
H  -2.956094 1.158171 -2.153001
H  -4.297158 0.088793 -1.821806
H  -5.371411 0.39927 0.698946
H  -5.117947 1.945806 1.483828
H  -3.408126 2.540989 -0.241273
H  -4.9780 2.237286 -0.956334
elementType: O N C H
totalener: -1094.86649506 hartree
nucrepener: 2241.32992719 hartree
electener: -3336.19642225 hartree
oneelecener: -5945.40550054 hartree
twoeener: 2609.20907829 hartree
cpcmener: -0.04286414 hartree
kineticenergy: 1090.05359830 hartree
xcener: -105.979200754605 hartree
chargesum: -0.0000000
charge: -0.285854 -0.479426 -0.429029 -0.433245 -0.088496 0.147578 -0.023800 -0.122626 -0.265302 -0.294886 -0.270803 0.414473 -0.017887 0.073539 -0.196453 -0.273418 -0.047651 -0.097002 -0.079600 -0.079538 -0.121541 -0.155292 0.332206 0.306558 0.114991 0.097237 0.088348 0.095582 0.096843 0.103452 0.098619 0.088689 0.128333 0.134054 0.144271 0.103737 0.050906 0.093520 0.094570 0.077837 0.122469 0.099698 0.104793 0.104396 0.112764 0.077900 0.080185 0.087984 0.086319
qa: -0.2859 -0.4794 -0.4290 -0.4332 -0.0885 0.1476 -0.0238 -0.1226 -0.2653 -0.2949 -0.2708 0.4145 -0.0179 0.0735 -0.1965 -0.2734 -0.0477 -0.0970 -0.0796 -0.0795 -0.1215 -0.1553 0.3322 0.3066 0.1150 0.0972 0.0883 0.0956 0.0968 0.1035 0.0986 0.0887 0.1283 0.1341 0.1443 0.1037 0.0509 0.0935 0.0946 0.0778 0.1225 0.0997 0.1048 0.1044 0.1128 0.0779 0.0802 0.0880 0.0863
va: 2.1052 2.0111 2.0788 2.0691 3.0767 3.7605 3.7969 3.8408 3.8962 3.8875 3.8242 4.0998 3.6759 3.9073 3.9210 3.9422 3.5904 3.6634 3.9116 3.8985 3.9087 3.9150 4.1901 4.1718 1.0030 1.0305 1.0039 1.0022 1.0023 0.9995 0.9993 1.0190 1.0021 1.0141 0.9965 0.9970 1.0035 1.0120 1.0084 1.0056 0.9985 1.0162 1.0023 1.0050 1.0041 1.0072 1.0106 1.0024 1.0117
dispcorr: -0.029037991 hartree
energy: -1094.895533048000
dipole: 5.52692 -6.40315 -0.87623 21.14126 -19.90393 1.23733 -1.84453 0.80481 -1.03972
magnitude: 1.83842 au
magnitude: 4.67288 debye
