program: Orca
programVersion: 5.0.2
elementType: O O O O N C C C C C C C C C C C C C C C C C C C H H H H H H H H H H H H H H H H H H H H H H H H H
charge: 0
multiplicity: 1
keywords: wb97x-d3
keywords: def2-TZVPP
keywords: def2/J RIJCOSX
keywords: DEFGRID2
keywords: scfconv7
keywords: smallprint printgap noloewdin
keywords: NOSOSCF
formula: C19H25NO4
InChI: InChI=1/C19H25NO4/c1-11(2)9-14-15(19(14,3)4)18(23)24-10-20-16(21)12-7-5-6-8-13(12)17(20)22/h9,14-15H,5-8,10H2,1-4H3
49 atoms
O  1.202209 -1.807107 -1.120836
O  1.304181 -1.250689 1.04111
O  -1.218176 -0.656788 -2.697375
O  -1.530456 -2.137887 1.590898
N  -1.107507 -1.681512 -0.637217
C  4.060667 -0.001086 0.435745
C  3.089478 1.040468 0.005855
C  2.934982 -0.40339 -0.498011
C  5.423487 0.019616 -0.216825
C  4.114926 -0.477536 1.866814
C  2.098586 1.650164 0.926459
C  1.764456 -1.177155 -0.072975
C  0.938073 2.1844 0.536536
C  0.006803 -2.539877 -0.896752
C  0.00034 2.820904 1.514928
C  0.480282 2.1999 -0.888949
C  -2.585251 0.078104 -0.836265
C  -2.656589 -0.347243 0.425579
C  -3.358381 1.213045 -1.396417
C  -3.526133 0.231865 1.476874
C  -3.922258 2.048603 -0.246525
C  -4.549605 1.171291 0.836518
C  -1.583684 -0.749169 -1.551451
C  -1.719187 -1.483322 0.597305
H  3.438179 1.698993 -0.78515
H  3.217275 -0.559805 -1.532147
H  5.374164 0.350098 -1.254954
H  6.090754 0.69837 0.317327
H  5.876973 -0.972957 -0.202311
H  3.175583 -0.392153 2.404269
H  4.43187 -1.520752 1.911637
H  4.856102 0.110964 2.410753
H  2.355136 1.68519 1.980891
H  0.108648 -3.245942 -0.073666
H  -0.156847 -3.098225 -1.814769
H  0.405259 2.834591 2.526486
H  -0.230029 3.849816 1.227052
H  -0.95449 2.28705 1.540044
H  1.020863 1.501101 -1.525359
H  -0.583803 1.967081 -0.954004
H  0.596797 3.198606 -1.319163
H  -2.727696 1.819357 -2.050546
H  -4.165737 0.826403 -2.026569
H  -4.021357 -0.560321 2.04294
H  -2.900007 0.770824 2.195875
H  -3.11557 2.644807 0.190773
H  -4.660397 2.75227 -0.63259
H  -5.355582 0.577334 0.396573
H  -5.005106 1.793786 1.607372
elementType: O N C H
totalener: -1094.86663597 hartree
nucrepener: 2243.01558036 hartree
electener: -3337.88221633 hartree
oneelecener: -5948.78476862 hartree
twoeener: 2610.90255228 hartree
cpcmener: -0.04262691 hartree
kineticenergy: 1090.05247820 hartree
xcener: -105.979260764287 hartree
chargesum: 0.0000000
charge: -0.289169 -0.481935 -0.431960 -0.428882 -0.091682 0.137640 -0.012313 -0.118601 -0.265280 -0.297608 -0.280637 0.416164 -0.007051 0.081428 -0.221985 -0.246453 -0.098626 -0.049894 -0.068900 -0.089095 -0.156241 -0.121027 0.307631 0.330975 0.116355 0.096925 0.088026 0.095420 0.095882 0.091722 0.103058 0.098976 0.125724 0.133227 0.144024 0.095092 0.102011 0.073244 0.094883 0.055468 0.122910 0.097185 0.113309 0.102420 0.106893 0.084795 0.086093 0.078589 0.081271
qa: -0.2892 -0.4819 -0.4320 -0.4289 -0.0917 0.1376 -0.0123 -0.1186 -0.2653 -0.2976 -0.2806 0.4162 -0.0071 0.0814 -0.2220 -0.2465 -0.0986 -0.0499 -0.0689 -0.0891 -0.1562 -0.1210 0.3076 0.3310 0.1164 0.0969 0.0880 0.0954 0.0959 0.0917 0.1031 0.0990 0.1257 0.1332 0.1440 0.0951 0.1020 0.0732 0.0949 0.0555 0.1229 0.0972 0.1133 0.1024 0.1069 0.0848 0.0861 0.0786 0.0813
va: 2.1064 2.0066 2.0698 2.0786 3.0742 3.7527 3.8059 3.8298 3.8992 3.8920 3.8451 4.0787 3.6691 3.9046 3.9291 3.9422 3.6488 3.5987 3.8804 3.9199 3.9172 3.8992 4.1741 4.1865 1.0040 1.0300 1.0043 1.0019 1.0023 1.0167 1.0000 0.9990 1.0015 1.0149 0.9953 1.0115 0.9957 0.9972 1.0119 1.0115 0.9987 1.0107 1.0032 1.0155 1.0001 1.0045 1.0118 1.0069 1.0102
dispcorr: -0.029092862 hartree
energy: -1094.895728833804
dipole: 6.63252 -7.30324 -0.67073 20.05885 -18.59778 1.46107 5.94185 -6.53670 -0.59485
magnitude: 1.71419 au
magnitude: 4.35713 debye
