program: Orca
programVersion: 5.0.2
elementType: O O O O N C C C C C C C C C C C C C C C C C C C H H H H H H H H H H H H H H H H H H H H H H H H H
charge: 0
multiplicity: 1
keywords: wb97x-d3
keywords: def2-TZVPP
keywords: def2/J RIJCOSX
keywords: DEFGRID2
keywords: scfconv7
keywords: smallprint printgap noloewdin
keywords: NOSOSCF
formula: C19H25NO4
InChI: InChI=1/C19H25NO4/c1-11(2)9-14-15(19(14,3)4)18(23)24-10-20-16(21)12-7-5-6-8-13(12)17(20)22/h9,14-15H,5-8,10H2,1-4H3
49 atoms
O  1.320079 -1.490322 0.221095
O  1.993787 -2.205381 -1.791302
O  -1.440299 -1.252407 2.400155
O  -1.018725 -1.093583 -2.117543
N  -1.009337 -1.522969 0.148645
C  3.95556 -0.015326 0.46974
C  3.006081 0.936826 -0.171062
C  3.19854 -0.464768 -0.768475
C  5.428935 0.222982 0.22994
C  3.686578 -0.597162 1.836146
C  1.749743 1.383716 0.475394
C  2.129363 -1.468324 -0.839566
C  0.788252 2.092477 -0.124249
C  0.169135 -2.322494 0.224064
C  -0.399727 2.589184 0.641895
C  0.796727 2.447597 -1.579243
C  -2.730507 -0.097878 0.709928
C  -2.601269 -0.04283 -0.616356
C  -3.739697 0.645971 1.499661
C  -3.426462 0.791646 -1.521944
C  -4.820771 1.183065 0.560428
C  -4.223786 1.806172 -0.699851
C  -1.684163 -0.9988 1.246958
C  -1.475163 -0.919566 -1.014643
H  3.473217 1.688991 -0.800322
H  3.795225 -0.484469 -1.672774
H  5.993924 -0.706746 0.319366
H  5.618733 0.635553 -0.761528
H  5.826109 0.925657 0.964773
H  2.635869 -0.684409 2.094991
H  4.134126 -1.588516 1.924053
H  4.153786 0.038087 2.591127
H  1.625628 1.154269 1.529045
H  0.16424 -2.866388 1.165041
H  0.183476 -3.037687 -0.594483
H  -0.450359 2.167958 1.646448
H  -0.368326 3.678673 0.734555
H  -1.331805 2.353303 0.124831
H  0.55175 3.502672 -1.727044
H  1.749358 2.24908 -2.070069
H  0.028927 1.874491 -2.110519
H  -4.172839 0.001321 2.267844
H  -3.245582 1.464486 2.034126
H  -2.789187 1.295775 -2.252942
H  -4.095893 0.145848 -2.098953
H  -5.489846 0.365091 0.278715
H  -5.429601 1.918342 1.087664
H  -3.567733 2.633722 -0.415909
H  -5.015013 2.232463 -1.317475
elementType: O N C H
totalener: -1094.86415561 hartree
nucrepener: 2240.89472105 hartree
electener: -3335.75887666 hartree
oneelecener: -5943.82311789 hartree
twoeener: 2608.06424123 hartree
cpcmener: -0.04262019 hartree
kineticenergy: 1090.05034390 hartree
xcener: -105.979862316737 hartree
chargesum: -0.0000000
charge: -0.263506 -0.492189 -0.436398 -0.433514 -0.082186 0.141426 -0.041049 -0.137079 -0.263576 -0.286134 -0.251208 0.439187 -0.024484 0.060648 -0.223615 -0.266934 -0.097088 -0.027354 -0.075992 -0.075575 -0.129406 -0.145620 0.345626 0.291421 0.113414 0.092033 0.096276 0.088652 0.094379 0.086365 0.104944 0.099450 0.128182 0.127060 0.142333 0.093200 0.116135 0.058667 0.105105 0.094523 0.089688 0.099558 0.103562 0.099001 0.108742 0.078553 0.081188 0.086073 0.087517
qa: -0.2635 -0.4922 -0.4364 -0.4335 -0.0822 0.1414 -0.0410 -0.1371 -0.2636 -0.2861 -0.2512 0.4392 -0.0245 0.0606 -0.2236 -0.2669 -0.0971 -0.0274 -0.0760 -0.0756 -0.1294 -0.1456 0.3456 0.2914 0.1134 0.0920 0.0963 0.0887 0.0944 0.0864 0.1049 0.0994 0.1282 0.1271 0.1423 0.0932 0.1161 0.0587 0.1051 0.0945 0.0897 0.0996 0.1036 0.0990 0.1087 0.0786 0.0812 0.0861 0.0875
va: 2.1072 2.0116 2.0689 2.0678 3.1128 3.7613 3.7807 3.8676 3.8969 3.8974 3.8131 4.1115 3.6793 3.8808 3.9331 3.9437 3.6850 3.5862 3.9145 3.8938 3.9131 3.9099 4.1570 4.1844 1.0023 1.0294 1.0017 1.0052 1.0023 1.0157 1.0000 0.9991 1.0018 1.0143 1.0185 1.0086 0.9985 0.9988 0.9987 1.0074 1.0042 1.0162 1.0050 1.0132 1.0045 1.0071 1.0103 1.0012 1.0105
dispcorr: -0.029429979 hartree
energy: -1094.893585594244
dipole: 3.65167 -4.96518 -1.31351 20.32486 -18.38667 1.93819 3.36808 -2.42414 0.94394
magnitude: 2.52446 au
magnitude: 6.41667 debye
