program: Orca
programVersion: 5.0.2
elementType: O O O O N C C C C C C C C C C C C C C C C C C C H H H H H H H H H H H H H H H H H H H H H H H H H
charge: 0
multiplicity: 1
keywords: wb97x-d3
keywords: def2-TZVPP
keywords: def2/J RIJCOSX
keywords: DEFGRID2
keywords: scfconv7
keywords: smallprint printgap noloewdin
keywords: NOSOSCF
formula: C19H25NO4
InChI: InChI=1/C19H25NO4/c1-11(2)9-14-15(19(14,3)4)18(23)24-10-20-16(21)12-7-5-6-8-13(12)17(20)22/h9,14-15H,5-8,10H2,1-4H3
49 atoms
O  1.058986 -1.431547 -1.530204
O  0.542334 0.701391 -1.108847
O  -0.534693 -3.002187 0.51526
O  -2.44508 0.243647 -2.03064
N  -1.260053 -1.488473 -1.063993
C  2.787621 -0.023522 1.090366
C  3.323778 1.022012 0.169117
C  2.661817 -0.208474 -0.417231
C  3.768137 -0.94202 1.777446
C  1.55403 0.257384 1.913045
C  2.764893 2.399007 0.124173
C  1.330215 -0.208206 -1.045575
C  2.706586 3.183844 -0.953172
C  -0.238767 -1.683517 -2.046276
C  2.184147 4.585431 -0.867343
C  3.124426 2.741657 -2.320373
C  -2.35619 -1.472015 0.961907
C  -2.897558 -0.50312 0.223437
C  -2.769056 -1.827375 2.341127
C  -3.990744 0.396887 0.663946
C  -4.111346 -1.164572 2.657435
C  -4.158508 0.286636 2.180694
C  -1.276926 -2.116628 0.173961
C  -2.217023 -0.47764 -1.095415
H  4.403289 0.984999 0.038027
H  3.332486 -0.951317 -0.835067
H  4.656195 -1.117459 1.168764
H  4.097027 -0.512705 2.726545
H  3.314683 -1.911883 1.992439
H  0.841768 0.921724 1.427995
H  1.033098 -0.673318 2.1495
H  1.835668 0.721203 2.860699
H  2.432522 2.809036 1.074312
H  -0.211599 -2.721291 -2.370042
H  -0.460682 -1.052703 -2.907308
H  1.307146 4.715925 -1.50722
H  1.900953 4.857649 0.149582
H  2.928769 5.307033 -1.2142
H  3.4835 1.714097 -2.349522
H  2.290914 2.826106 -3.023607
H  3.919506 3.383459 -2.710606
H  -2.831712 -2.912404 2.453748
H  -1.996787 -1.496815 3.04379
H  -3.776385 1.426952 0.36903
H  -4.917392 0.122941 0.149042
H  -4.913564 -1.729837 2.17441
H  -4.298694 -1.212495 3.731124
H  -3.363426 0.8551 2.672055
H  -5.101152 0.748274 2.478283
elementType: O N C H
totalener: -1094.87339318 hartree
nucrepener: 2193.10702214 hartree
electener: -3287.98041532 hartree
oneelecener: -5849.27237353 hartree
twoeener: 2561.29195821 hartree
cpcmener: -0.03269746 hartree
kineticenergy: 1090.04048653 hartree
xcener: -105.971523884374 hartree
chargesum: -0.0000000
charge: -0.279354 -0.446897 -0.410233 -0.401890 -0.100619 0.153626 -0.022413 -0.121851 -0.265761 -0.308898 -0.265999 0.382875 -0.023752 0.085295 -0.224638 -0.269575 -0.089212 -0.038406 -0.068873 -0.074981 -0.137827 -0.135605 0.300111 0.299796 0.115599 0.099248 0.086621 0.093513 0.096074 0.098548 0.093078 0.108344 0.120596 0.140986 0.132234 0.094730 0.087760 0.093648 0.093460 0.098294 0.105655 0.094291 0.099934 0.093691 0.099974 0.077996 0.081014 0.078880 0.080915
qa: -0.2794 -0.4469 -0.4102 -0.4019 -0.1006 0.1536 -0.0224 -0.1219 -0.2658 -0.3089 -0.2660 0.3829 -0.0238 0.0853 -0.2246 -0.2696 -0.0892 -0.0384 -0.0689 -0.0750 -0.1378 -0.1356 0.3001 0.2998 0.1156 0.0992 0.0866 0.0935 0.0961 0.0985 0.0931 0.1083 0.1206 0.1410 0.1322 0.0947 0.0878 0.0936 0.0935 0.0983 0.1057 0.0943 0.0999 0.0937 0.1000 0.0780 0.0810 0.0789 0.0809
va: 2.1114 2.0443 2.0993 2.1148 3.0665 3.7320 3.8498 3.8142 3.8988 3.9059 3.8539 4.1259 3.7037 3.8999 3.9247 3.9488 3.7001 3.6271 3.9202 3.9141 3.9183 3.9142 4.1990 4.2161 1.0026 1.0289 1.0052 1.0015 1.0024 1.0105 1.0101 1.0000 1.0004 0.9917 1.0146 0.9966 1.0075 0.9966 1.0035 0.9987 1.0002 1.0154 1.0061 1.0157 1.0045 1.0062 1.0094 1.0070 1.0093
dispcorr: -0.026102243 hartree
energy: -1094.899495425495
dipole: 9.50905 -9.77058 -0.26153 14.85010 -15.09198 -0.24189 12.90171 -11.70491 1.19680
magnitude: 1.24869 au
magnitude: 3.17393 debye
