program: Orca
programVersion: 5.0.2
elementType: O O O O N C C C C C C C C C C C C C C C C C C C H H H H H H H H H H H H H H H H H H H H H H H H H
charge: 0
multiplicity: 1
keywords: wb97x-d3
keywords: def2-TZVPP
keywords: def2/J RIJCOSX
keywords: DEFGRID2
keywords: scfconv7
keywords: smallprint printgap noloewdin
keywords: NOSOSCF
formula: C19H25NO4
InChI: InChI=1/C19H25NO4/c1-11(2)9-14-15(19(14,3)4)18(23)24-10-20-16(21)12-7-5-6-8-13(12)17(20)22/h9,14-15H,5-8,10H2,1-4H3
49 atoms
O  1.162191 -0.978186 -0.497377
O  2.651479 -2.144242 -1.665099
O  -1.519855 0.458772 -2.204135
O  -1.249063 -2.360459 1.346266
N  -1.112902 -1.167658 -0.621244
C  3.450522 -0.180265 1.345048
C  3.318765 0.909221 0.337844
C  3.452462 -0.537242 -0.134153
C  4.788545 -0.345204 2.027346
C  2.292849 -0.538943 2.244516
C  2.08708 1.728639 0.198074
C  2.40512 -1.294749 -0.837097
C  1.65678 2.288765 -0.934387
C  0.103891 -1.697575 -1.125602
C  0.466732 3.198464 -0.95135
C  2.308832 2.066878 -2.263484
C  -2.911669 0.218391 -0.235942
C  -2.84375 -0.623493 0.796336
C  -3.929614 1.283824 -0.403305
C  -3.793041 -0.659016 1.9342
C  -4.679937 1.486611 0.915055
C  -5.036685 0.160844 1.586187
C  -1.79902 -0.08929 -1.168796
C  -1.669147 -1.508908 0.606497
H  4.235007 1.464683 0.149908
H  4.428701 -0.792088 -0.530259
H  5.618958 -0.091668 1.366938
H  4.854321 0.301358 2.905086
H  4.933055 -1.374429 2.362751
H  2.295894 -1.605322 2.477549
H  2.393504 -0.000405 3.189054
H  1.316684 -0.291621 1.837305
H  1.536333 1.931279 1.112649
H  0.165938 -2.760095 -0.890933
H  0.131923 -1.569731 -2.207219
H  0.762266 4.2136 -1.229521
H  -0.269498 2.881434 -1.69301
H  -0.028795 3.249521 0.018406
H  1.605171 1.599935 -2.958617
H  2.603041 3.017009 -2.717257
H  3.194015 1.435695 -2.210409
H  -3.454049 2.213163 -0.726759
H  -4.619331 1.004405 -1.20632
H  -4.060473 -1.691471 2.172225
H  -3.30173 -0.262458 2.828574
H  -4.059976 2.079427 1.593667
H  -5.585148 2.067389 0.732667
H  -5.676934 -0.42302 0.918693
H  -5.616573 0.345223 2.491492
elementType: O N C H
totalener: -1094.87515988 hartree
nucrepener: 2195.80172015 hartree
electener: -3290.67688003 hartree
oneelecener: -5853.59280226 hartree
twoeener: 2562.91592223 hartree
cpcmener: -0.03056459 hartree
kineticenergy: 1090.05174918 hartree
xcener: -105.973189490835 hartree
chargesum: 0.0000000
charge: -0.251497 -0.472914 -0.411653 -0.409778 -0.088975 0.149178 -0.021884 -0.143233 -0.270125 -0.291610 -0.245408 0.411661 -0.036809 0.064626 -0.239355 -0.257255 -0.045245 -0.049367 -0.072306 -0.074466 -0.134383 -0.135669 0.283316 0.295757 0.113498 0.094871 0.086615 0.092878 0.096223 0.105716 0.098907 0.080993 0.120662 0.137275 0.132380 0.107568 0.085506 0.090592 0.095202 0.105753 0.092312 0.094429 0.102409 0.094278 0.101687 0.078141 0.080421 0.078460 0.080618
qa: -0.2515 -0.4729 -0.4117 -0.4098 -0.0890 0.1492 -0.0219 -0.1432 -0.2701 -0.2916 -0.2454 0.4117 -0.0368 0.0646 -0.2394 -0.2573 -0.0452 -0.0494 -0.0723 -0.0745 -0.1344 -0.1357 0.2833 0.2958 0.1135 0.0949 0.0866 0.0929 0.0962 0.1057 0.0989 0.0810 0.1207 0.1373 0.1324 0.1076 0.0855 0.0906 0.0952 0.1058 0.0923 0.0944 0.1024 0.0943 0.1017 0.0781 0.0804 0.0785 0.0806
va: 2.1014 2.0327 2.0931 2.1006 3.1309 3.6968 3.8040 3.8721 3.9084 3.9170 3.8358 4.1028 3.7008 3.9024 3.9204 3.9404 3.6825 3.6889 3.9172 3.9174 3.9141 3.9169 4.1876 4.1898 1.0051 1.0280 1.0054 1.0022 1.0012 1.0013 1.0003 1.0051 1.0000 1.0011 1.0054 0.9972 1.0064 1.0058 1.0029 0.9997 1.0059 1.0135 1.0052 1.0146 1.0052 1.0069 1.0097 1.0065 1.0099
dispcorr: -0.026928923 hartree
energy: -1094.902088804347
dipole: 3.16034 -4.84322 -1.68288 16.46592 -14.90517 1.56075 9.12445 -7.80457 1.31988
magnitude: 2.64766 au
magnitude: 6.72982 debye
