program: Orca
programVersion: 5.0.2
elementType: O O O O N C C C C C C C C C C C C C C C C C C C H H H H H H H H H H H H H H H H H H H H H H H H H
charge: 0
multiplicity: 1
keywords: wb97x-d3
keywords: def2-TZVPP
keywords: def2/J RIJCOSX
keywords: DEFGRID2
keywords: scfconv7
keywords: smallprint printgap noloewdin
keywords: NOSOSCF
formula: C19H25NO4
InChI: InChI=1/C19H25NO4/c1-11(2)9-14-15(19(14,3)4)18(23)24-10-20-16(21)12-7-5-6-8-13(12)17(20)22/h9,14-15H,5-8,10H2,1-4H3
49 atoms
O  1.053038 -1.607116 -1.201213
O  0.690354 0.594735 -1.082472
O  -2.197456 0.294226 -2.221593
O  -0.933851 -2.975309 0.676162
N  -1.298244 -1.474852 -1.035181
C  2.564332 0.080264 1.455148
C  3.337618 0.858355 0.444712
C  2.595448 -0.391926 0.006126
C  3.331061 -0.77849 2.430229
C  1.288693 0.640505 2.033054
C  2.96474 2.240399 0.046175
C  1.369658 -0.362112 -0.807272
C  3.211364 2.795391 -1.141971
C  -0.184291 -1.813782 -1.864608
C  2.847643 4.220307 -1.427685
C  3.82981 2.053585 -2.285378
C  -2.976637 -0.278329 -0.006589
C  -2.619787 -1.24608 0.838164
C  -4.024471 0.738252 0.253086
C  -3.222414 -1.481784 2.172621
C  -4.37526 0.735666 1.742181
C  -4.521235 -0.682047 2.293947
C  -2.146833 -0.388221 -1.232345
C  -1.528322 -2.034286 0.215208
H  4.411037 0.684349 0.474556
H  3.209573 -1.267953 -0.169452
H  4.251072 -1.16927 1.993466
H  3.60487 -0.202059 3.316696
H  2.731974 -1.629428 2.760851
H  1.512737 1.216091 2.933632
H  0.748984 1.298478 1.355792
H  0.61134 -0.166245 2.323092
H  2.497993 2.854011 0.811826
H  -0.195848 -2.873954 -2.106233
H  -0.251251 -1.241463 -2.789915
H  2.135179 4.283198 -2.25481
H  2.401852 4.713067 -0.563397
H  3.724169 4.799157 -1.730836
H  4.102285 1.029097 -2.037587
H  3.143547 2.019618 -3.136201
H  4.730399 2.56304 -2.638403
H  -3.682213 1.7257 -0.065715
H  -4.907079 0.514907 -0.355116
H  -3.403405 -2.548172 2.327293
H  -2.507952 -1.183106 2.947046
H  -3.590562 1.259826 2.295429
H  -5.297404 1.296284 1.90193
H  -5.315062 -1.201934 1.74986
H  -4.831698 -0.646331 3.339188
elementType: O N C H
totalener: -1094.87438342 hartree
nucrepener: 2185.30749194 hartree
electener: -3280.18187535 hartree
oneelecener: -5833.61657757 hartree
twoeener: 2553.43470221 hartree
cpcmener: -0.03323361 hartree
kineticenergy: 1090.04561435 hartree
xcener: -105.972593845673 hartree
chargesum: -0.0000000
charge: -0.280810 -0.448562 -0.401056 -0.410783 -0.104908 0.149295 -0.026294 -0.123625 -0.264027 -0.307759 -0.256849 0.387870 -0.029985 0.086472 -0.225591 -0.265832 -0.040550 -0.093832 -0.075570 -0.070086 -0.135741 -0.137280 0.302557 0.310830 0.115505 0.097850 0.086395 0.093703 0.096132 0.105787 0.097905 0.097408 0.121488 0.141234 0.132339 0.094586 0.087592 0.094288 0.092134 0.098317 0.104376 0.093529 0.099897 0.093856 0.099997 0.078636 0.080953 0.077919 0.080291
qa: -0.2808 -0.4486 -0.4011 -0.4108 -0.1049 0.1493 -0.0263 -0.1236 -0.2640 -0.3078 -0.2568 0.3879 -0.0300 0.0865 -0.2256 -0.2658 -0.0406 -0.0938 -0.0756 -0.0701 -0.1357 -0.1373 0.3026 0.3108 0.1155 0.0978 0.0864 0.0937 0.0961 0.1058 0.0979 0.0974 0.1215 0.1412 0.1323 0.0946 0.0876 0.0943 0.0921 0.0983 0.1044 0.0935 0.0999 0.0939 0.1000 0.0786 0.0810 0.0779 0.0803
va: 2.1101 2.0416 2.1153 2.1027 3.0663 3.7334 3.8509 3.8152 3.8998 3.9093 3.8502 4.1245 3.7129 3.9007 3.9267 3.9465 3.6225 3.6906 3.9152 3.9190 3.9137 3.9167 4.2165 4.2007 1.0031 1.0294 1.0051 1.0020 1.0023 1.0000 1.0108 1.0049 0.9996 0.9918 1.0146 0.9963 1.0075 0.9966 1.0046 0.9980 0.9998 1.0160 1.0046 1.0156 1.0060 1.0071 1.0093 1.0061 1.0095
dispcorr: -0.025690282 hartree
energy: -1094.900073697997
dipole: 9.87757 -10.26173 -0.38416 15.39160 -15.49197 -0.10036 11.90347 -10.67238 1.23108
magnitude: 1.29353 au
magnitude: 3.28789 debye
