program: Orca
programVersion: 5.0.2
elementType: O O O O N C C C C C C C C C C C C C C C C C C C H H H H H H H H H H H H H H H H H H H H H H H H H
charge: 0
multiplicity: 1
keywords: wb97x-d3
keywords: def2-TZVPP
keywords: def2/J RIJCOSX
keywords: DEFGRID2
keywords: scfconv7
keywords: smallprint printgap noloewdin
keywords: NOSOSCF
formula: C19H25NO4
InChI: InChI=1/C19H25NO4/c1-11(2)9-14-15(19(14,3)4)18(23)24-10-20-16(21)12-7-5-6-8-13(12)17(20)22/h9,14-15H,5-8,10H2,1-4H3
49 atoms
O  1.207477 -1.837409 -1.081989
O  1.286251 -1.244802 1.069914
O  -1.163708 -0.603947 -2.66678
O  -1.620126 -2.173786 1.576357
N  -1.096965 -1.646371 -0.614341
C  4.068687 -0.038421 0.470564
C  3.106919 1.006107 0.025169
C  2.946431 -0.44365 -0.464192
C  5.434984 -0.024641 -0.176265
C  4.116232 -0.505127 1.90481
C  2.105093 1.628622 0.92216
C  1.761054 -1.197797 -0.037522
C  1.046237 2.322691 0.495302
C  -0.008017 -2.536458 -0.868591
C  0.069947 2.925092 1.457194
C  0.721306 2.510078 -0.956326
C  -2.579129 0.104815 -0.83252
C  -2.702318 -0.354309 0.413133
C  -3.349852 1.235162 -1.405999
C  -3.6264 0.191079 1.436874
C  -4.534313 1.55957 -0.493972
C  -4.139236 1.558502 0.982081
C  -1.552161 -0.707273 -1.530925
C  -1.766971 -1.49285 0.595982
H  3.467204 1.654656 -0.768909
H  3.232049 -0.6174 -1.495026
H  5.391261 0.291362 -1.219559
H  6.101189 0.662448 0.349552
H  5.890711 -1.016496 -0.147856
H  4.464388 -1.538315 1.958541
H  4.82968 0.107979 2.459123
H  3.16585 -0.452345 2.426709
H  2.249692 1.514997 1.99162
H  0.066266 -3.245505 -0.044182
H  -0.179109 -3.08831 -1.790056
H  0.314232 2.695367 2.494234
H  0.031342 4.012577 1.350954
H  -0.943692 2.562097 1.262011
H  1.597159 2.467418 -1.603023
H  0.032703 1.73411 -1.301541
H  0.225551 3.466828 -1.130164
H  -2.689226 2.102951 -1.507706
H  -3.688619 0.994929 -2.416559
H  -4.457541 -0.506903 1.58122
H  -3.123524 0.263915 2.404075
H  -4.951482 2.529471 -0.768379
H  -5.325802 0.822408 -0.657477
H  -4.990368 1.85302 1.597882
H  -3.359286 2.307861 1.148527
elementType: O N C H
totalener: -1094.87534410 hartree
nucrepener: 2226.77955689 hartree
electener: -3321.65490099 hartree
oneelecener: -5916.19472545 hartree
twoeener: 2594.53982446 hartree
cpcmener: -0.03402566 hartree
kineticenergy: 1090.04744397 hartree
xcener: -105.974048688076 hartree
chargesum: 0.0000000
charge: -0.286251 -0.455093 -0.409229 -0.400538 -0.091443 0.133938 -0.044263 -0.094123 -0.261984 -0.293269 -0.233922 0.389794 -0.027962 0.085562 -0.200767 -0.280113 -0.100077 -0.053852 -0.065420 -0.074820 -0.130623 -0.154454 0.296230 0.311546 0.111048 0.090994 0.086036 0.095107 0.095214 0.100556 0.097776 0.093193 0.123624 0.130199 0.141471 0.089714 0.097643 0.067293 0.103876 0.083305 0.105608 0.100360 0.096099 0.104971 0.095670 0.080955 0.078473 0.086451 0.085499
qa: -0.2863 -0.4551 -0.4092 -0.4005 -0.0914 0.1339 -0.0443 -0.0941 -0.2620 -0.2933 -0.2339 0.3898 -0.0280 0.0856 -0.2008 -0.2801 -0.1001 -0.0539 -0.0654 -0.0748 -0.1306 -0.1545 0.2962 0.3115 0.1110 0.0910 0.0860 0.0951 0.0952 0.1006 0.0978 0.0932 0.1236 0.1302 0.1415 0.0897 0.0976 0.0673 0.1039 0.0833 0.1056 0.1004 0.0961 0.1050 0.0957 0.0810 0.0785 0.0865 0.0855
va: 2.1094 2.0383 2.1008 2.1158 3.0650 3.7728 3.8146 3.8363 3.8966 3.8924 3.8159 4.1120 3.7015 3.9002 3.9298 3.9498 3.6556 3.6093 3.9113 3.9044 3.9089 3.9215 4.1914 4.2196 1.0049 1.0314 1.0046 1.0022 1.0028 1.0000 0.9992 1.0197 1.0022 1.0164 0.9943 1.0103 0.9987 0.9965 1.0078 1.0043 1.0007 1.0061 1.0172 1.0039 1.0155 1.0101 1.0071 1.0108 1.0017
dispcorr: -0.027848677 hartree
energy: -1094.903192776723
dipole: 6.82645 -7.49312 -0.66667 20.29710 -18.98405 1.31305 5.54239 -6.09296 -0.55057
magnitude: 1.57215 au
magnitude: 3.99609 debye
