program: Orca
programVersion: 5.0.2
elementType: O O O O N C C C C C C C C C C C C C C C C C C C H H H H H H H H H H H H H H H H H H H H H H H H H
charge: 0
multiplicity: 1
keywords: wb97x-d3
keywords: def2-TZVPP
keywords: def2/J RIJCOSX
keywords: DEFGRID2
keywords: scfconv7
keywords: smallprint printgap noloewdin
keywords: NOSOSCF
formula: C19H25NO4
InChI: InChI=1/C19H25NO4/c1-11(2)9-14-15(19(14,3)4)18(23)24-10-20-16(21)12-7-5-6-8-13(12)17(20)22/h9,14-15H,5-8,10H2,1-4H3
49 atoms
O  0.486279 -0.181552 0.011963
O  2.235237 -0.817111 1.238696
O  -1.531482 -2.668915 -1.163204
O  -2.494271 0.97993 1.36791
N  -1.676114 -0.89387 0.301164
C  3.931826 0.288545 -1.153935
C  3.781695 1.418244 -0.196825
C  2.542621 0.640042 -0.648116
C  4.176955 0.634529 -2.604065
C  4.61416 -0.990185 -0.736221
C  4.304673 1.361166 1.191176
C  1.793489 -0.196135 0.301222
C  3.807387 2.044025 2.224961
C  -0.371149 -0.943666 0.858905
C  4.434843 1.974451 3.583185
C  2.596006 2.918342 2.125002
C  -3.516126 -1.289997 -1.025581
C  -3.80305 -0.225531 -0.274858
C  -4.42481 -1.899171 -2.027186
C  -5.090245 0.511095 -0.296257
C  -5.581694 -0.940508 -2.315003
C  -6.140621 -0.320537 -1.035092
C  -2.145289 -1.747434 -0.691357
C  -2.628068 0.081205 0.578629
H  3.81186 2.407324 -0.647058
H  1.912614 1.154034 -1.364641
H  3.81664 -0.157224 -3.263971
H  3.678638 1.560943 -2.893092
H  5.245446 0.76141 -2.790833
H  4.239402 -1.832251 -1.321321
H  5.685982 -0.911253 -0.930242
H  4.491066 -1.238353 0.314381
H  5.181956 0.742586 1.357048
H  -0.391736 -0.523205 1.864537
H  -0.042548 -1.981305 0.914941
H  5.325707 1.346386 3.595479
H  4.718802 2.968835 3.938269
H  3.730706 1.574837 4.31797
H  1.8776 2.67402 2.911447
H  2.862049 3.969421 2.268539
H  2.082859 2.835177 1.168229
H  -3.877072 -2.137716 -2.942137
H  -4.798288 -2.854045 -1.643083
H  -5.416075 0.736953 0.72199
H  -4.944933 1.479061 -0.786947
H  -5.232031 -0.145424 -2.980021
H  -6.370705 -1.470623 -2.85034
H  -6.498174 -1.116214 -0.374946
H  -7.004687 0.303812 -1.266799
elementType: O N C H
totalener: -1094.87790454 hartree
nucrepener: 2072.25357750 hartree
electener: -3167.13148205 hartree
oneelecener: -5606.96844632 hartree
twoeener: 2439.83696427 hartree
cpcmener: -0.03113700 hartree
kineticenergy: 1090.03645817 hartree
xcener: -105.969470858076 hartree
chargesum: 0.0000000
charge: -0.283642 -0.464779 -0.408154 -0.408412 -0.112388 0.130414 -0.022322 -0.084184 -0.262992 -0.297852 -0.265546 0.383037 -0.017373 0.087771 -0.223095 -0.268558 -0.070472 -0.075892 -0.071271 -0.072429 -0.135428 -0.135458 0.317637 0.321485 0.115360 0.094508 0.095740 0.086363 0.093714 0.100963 0.099268 0.096209 0.120391 0.132544 0.127428 0.088161 0.093645 0.094727 0.096364 0.107916 0.090918 0.093622 0.100122 0.093613 0.101149 0.077678 0.080674 0.077888 0.080940
qa: -0.2836 -0.4648 -0.4082 -0.4084 -0.1124 0.1304 -0.0223 -0.0842 -0.2630 -0.2979 -0.2655 0.3830 -0.0174 0.0878 -0.2231 -0.2686 -0.0705 -0.0759 -0.0713 -0.0724 -0.1354 -0.1355 0.3176 0.3215 0.1154 0.0945 0.0957 0.0864 0.0937 0.1010 0.0993 0.0962 0.1204 0.1325 0.1274 0.0882 0.0936 0.0947 0.0964 0.1079 0.0909 0.0936 0.1001 0.0936 0.1011 0.0777 0.0807 0.0779 0.0809
va: 2.1024 2.0206 2.1097 2.1096 3.1255 3.7433 3.8283 3.8381 3.9007 3.8975 3.8537 4.0837 3.7134 3.8937 3.9259 3.9442 3.6679 3.6757 3.9212 3.9218 3.9157 3.9143 4.2172 4.2160 1.0043 1.0283 1.0024 1.0049 1.0021 1.0008 0.9981 1.0151 1.0009 1.0018 1.0041 1.0076 0.9956 0.9972 0.9991 0.9979 1.0068 1.0154 1.0049 1.0152 1.0051 1.0069 1.0095 1.0070 1.0095
dispcorr: -0.022859981 hartree
energy: -1094.900764525395
dipole: 13.37949 -15.02184 -1.64235 9.86077 -9.17802 0.68275 -2.42815 1.21375 -1.21440
magnitude: 2.15366 au
magnitude: 5.47417 debye
