program: Orca
programVersion: 5.0.2
elementType: O O O O N C C C C C C C C C C C C C C C C C C C H H H H H H H H H H H H H H H H H H H H H H H H H
charge: 0
multiplicity: 1
keywords: wb97x-d3
keywords: def2-TZVPP
keywords: def2/J RIJCOSX
keywords: DEFGRID2
keywords: scfconv7
keywords: smallprint printgap noloewdin
keywords: NOSOSCF
formula: C19H25NO4
InChI: InChI=1/C19H25NO4/c1-11(2)9-14-15(19(14,3)4)18(23)24-10-20-16(21)12-7-5-6-8-13(12)17(20)22/h9,14-15H,5-8,10H2,1-4H3
49 atoms
O  0.420705 -0.616679 -0.14821
O  2.165146 -1.195336 1.108258
O  -1.921355 -2.802021 -1.528595
O  -2.2507 0.493931 1.579907
N  -1.748745 -1.276603 0.191965
C  3.87867 0.408699 -0.940219
C  3.388557 1.488118 -0.025595
C  2.400685 0.47522 -0.613548
C  4.230558 0.81467 -2.351732
C  4.762118 -0.694276 -0.411681
C  3.715869 1.53614 1.413457
C  1.704086 -0.524691 0.214648
C  4.231455 2.586502 2.062231
C  -0.407898 -1.507744 0.596937
C  4.511474 2.507339 3.53389
C  4.584497 3.902148 1.440391
C  -3.723435 -1.275452 -0.992468
C  -3.823485 -0.313079 -0.074222
C  -4.776981 -1.628449 -1.974812
C  -5.011821 0.549595 0.1346
C  -5.826676 -0.515979 -2.015749
C  -6.208148 -0.040164 -0.614586
C  -2.388285 -1.911641 -0.867103
C  -2.555586 -0.260343 0.693281
H  3.283232 2.459094 -0.497118
H  1.776403 0.877787 -1.402663
H  3.585037 1.612281 -2.721993
H  5.260906 1.172931 -2.401271
H  4.139674 -0.030809 -3.036744
H  4.618201 -1.614688 -0.980195
H  5.806919 -0.399979 -0.52849
H  4.608468 -0.925512 0.6378
H  3.527578 0.641343 1.994696
H  -0.316136 -1.321831 1.666648
H  -0.140552 -2.544617 0.392647
H  5.570373 2.680063 3.744476
H  3.960178 3.277765 4.079463
H  4.239075 1.539911 3.955192
H  4.010537 4.711724 1.898049
H  5.637013 4.135576 1.620875
H  4.421875 3.945636 0.36579
H  -4.33827 -1.788953 -2.962617
H  -5.232712 -2.582104 -1.689234
H  -5.227779 0.647522 1.201252
H  -4.790201 1.561166 -0.22085
H  -5.433366 0.328029 -2.589714
H  -6.712425 -0.868043 -2.546277
H  -6.609765 -0.882098 -0.043322
H  -7.004054 0.703569 -0.674399
elementType: O N C H
totalener: -1094.87820499 hartree
nucrepener: 2040.80705429 hartree
electener: -3135.68525928 hartree
oneelecener: -5543.89828752 hartree
twoeener: 2408.21302823 hartree
cpcmener: -0.03011479 hartree
kineticenergy: 1090.03596118 hartree
xcener: -105.970257392097 hartree
chargesum: -0.0000000
charge: -0.279539 -0.470791 -0.407714 -0.407562 -0.114470 0.121118 0.021961 -0.101123 -0.261862 -0.283909 -0.292943 0.403798 -0.040968 0.090233 -0.221573 -0.253721 -0.072947 -0.072433 -0.072577 -0.071644 -0.136605 -0.135038 0.319172 0.318562 0.112953 0.097224 0.086985 0.093404 0.094181 0.102387 0.095196 0.097484 0.122750 0.127295 0.132766 0.092044 0.092357 0.088858 0.096537 0.094534 0.087565 0.093590 0.100698 0.094099 0.101086 0.078467 0.081306 0.078009 0.080798
qa: -0.2795 -0.4708 -0.4077 -0.4076 -0.1145 0.1211 0.0220 -0.1011 -0.2619 -0.2839 -0.2929 0.4038 -0.0410 0.0902 -0.2216 -0.2537 -0.0729 -0.0724 -0.0726 -0.0716 -0.1366 -0.1350 0.3192 0.3186 0.1130 0.0972 0.0870 0.0934 0.0942 0.1024 0.0952 0.0975 0.1228 0.1273 0.1328 0.0920 0.0924 0.0889 0.0965 0.0945 0.0876 0.0936 0.1007 0.0941 0.1011 0.0785 0.0813 0.0780 0.0808
va: 2.1158 2.0228 2.1102 2.1096 3.1273 3.6989 3.7583 3.9180 3.9120 3.9042 3.8540 4.0720 3.7702 3.8903 3.9247 3.9412 3.6758 3.6645 3.9200 3.9226 3.9159 3.9136 4.2176 4.2172 1.0062 1.0267 1.0050 1.0022 1.0024 1.0000 1.0015 1.0137 1.0232 1.0038 1.0024 0.9969 0.9959 1.0088 0.9967 0.9975 1.0121 1.0156 1.0046 1.0148 1.0052 1.0069 1.0094 1.0069 1.0096
dispcorr: -0.021735486 hartree
energy: -1094.899940477985
dipole: 17.37138 -18.88292 -1.51154 16.13243 -15.07080 1.06163 -1.28735 0.17951 -1.10784
magnitude: 2.15386 au
magnitude: 5.47468 debye
