program: Gaussian 09
title: 000063828
version: EM64L-G09RevD.01
frameworkgroup: C1[X(C22H17Br2N3O3)]
method: RPBEPBE
basis: SDD
operation: Freq
keyword: #p
keyword: freq=noraman
keyword: PBEPBE/SDD
title: #p freq=noraman PBEPBE/SDD
converged: YES YES NO NO
title: Mulliken charges:
elementType: Br Br O O O N N N C C C C C C C C C C C C C C C C C C C C C C H H H H H H H H H H H H H H H H H
charge: 0.046438 0.031158 -0.202700 -0.465997 -0.428855 -0.158643 -0.257312 -0.005603 -0.585306 0.491373 0.164578 0.180759 0.450908 0.207138 0.182908 0.198821 -0.758180 -0.363889 -0.344499 -0.310325 -0.284020 -0.380981 -0.564212 -0.249685 -0.399192 -0.148544 -0.227616 -0.228001 0.327200 -0.266254 0.245333 0.226504 0.270172 0.261534 0.241994 0.209103 0.238839 0.222379 0.296034 0.214114 0.253264 0.275786 0.222046 0.224252 0.229340 0.362898 0.354942
chargesum: 0.00000
title: Mulliken charges with hydrogens summed into heavy atoms:
elementType: Br Br O O O N N N C C C C C C C C C C C C C C C C C C C C C C
charge: 0.046438 0.031158 -0.202700 -0.103099 -0.073913 -0.158643 -0.257312 -0.005603 -0.113469 0.491373 0.164578 0.180759 0.450908 0.207138 0.182908 0.198821 0.015520 -0.154786 -0.105659 -0.087946 0.012015 -0.380981 -0.350099 -0.249685 -0.145929 0.127242 -0.005570 -0.003749 0.327200 -0.036914
polarizability: 4.02118526e+02 -2.49481276e+01 3.27146496e+02 3.01618735e+01 2.15271699e+01 2.24922049e+02
1716.lowfreq: -5.2835 -2.2755 -0.0005 -0.0004 0.0003 2.2097 8.2141 16.3409 23.0317
frequency: 7.6166 16.3311 23.0266 29.6441 36.6506 63.8673 68.5095 77.7903 95.3636 106.1373 119.9173 123.7388 147.2086 152.0411 171.5551 185.9049 188.1167 190.7818 220.2876 222.2590 254.5901 282.2423 307.3437 324.3232 325.4228 336.0193 348.7087 356.2334 368.1504 374.1109 396.5059 404.9919 415.2221 437.1346 470.0103 486.7741 497.3970 500.9817 512.8022 530.8886 548.0343 552.7631 568.6005 585.0702 614.1528 615.1487 638.0150 644.1098 671.2311 689.4312 703.1453 717.4905 729.2065 733.8947 749.8584 771.2188 788.4165 797.1725 800.1604 813.7895 826.3219 842.0778 874.9797 887.6800 914.9769 929.4737 941.0629 946.3624 957.4033 977.6518 980.1171 981.2586 994.0997 1024.6957 1041.3106 1047.5621 1062.6484 1081.2232 1082.6576 1101.1720 1130.8778 1148.4496 1155.1314 1173.4039 1181.8205 1196.9816 1199.0942 1207.3652 1213.5916 1233.3742 1255.8634 1297.8815 1302.8120 1308.3802 1326.5309 1337.7310 1370.3061 1374.2755 1382.6434 1388.8742 1396.8631 1407.4881 1418.3445 1430.7027 1444.4151 1447.6578 1460.6803 1462.2894 1487.8477 1518.0577 1527.4861 1568.1005 1581.1906 1586.2777 1608.3009 1614.7261 1629.3385 1633.4096 2997.9894 3017.6702 3073.3536 3077.8388 3102.8340 3127.6013 3134.7145 3134.9854 3142.4780 3157.4563 3165.2604 3173.0655 3174.9731 3179.7128 3182.4204 3583.9300 3592.5724
redmass: 8.3599 11.7879 6.4280 6.1851 4.9312 4.7826 5.5789 6.7605 9.7018 12.2027 11.0335 8.2738 1.1931 7.0672 5.5306 5.0282 4.6909 3.1791 10.8301 5.9038 5.0505 8.4277 3.0661 3.4430 2.7160 1.1282 1.8918 6.2324 6.4183 4.4661 7.1174 3.0041 3.0577 2.7067 4.2378 4.5939 4.9093 4.6535 4.7242 5.8436 5.8926 4.6013 7.3765 5.6305 5.7213 4.0636 4.5391 5.1949 5.0298 1.9371 6.2457 5.2672 6.7738 6.2007 1.7812 2.1584 4.5339 4.7300 2.7672 1.3211 1.7180 5.2938 1.4412 1.4259 3.7015 1.4168 1.4720 3.6221 1.3703 3.1750 1.5517 3.3860 2.6033 3.2416 2.3468 1.5898 3.3089 2.2464 1.8572 1.8119 1.5546 2.9732 1.3520 1.0481 1.4105 1.3030 2.3025 2.3027 2.1367 1.8894 3.0019 3.4472 3.5158 1.7234 1.3651 1.6360 9.4029 1.5989 6.2108 4.0904 1.3974 4.1804 3.1605 3.2534 1.1945 2.2025 1.1201 1.0544 2.4272 2.8688 9.0205 7.2027 8.1979 6.3075 6.6807 6.4556 11.5994 6.8736 1.0382 1.0597 1.1033 1.0968 1.0915 1.0849 1.0892 1.0989 1.0895 1.0922 1.0942 1.0929 1.0988 1.0932 1.0955 1.0662 1.0662
irintensity: 0.2060 0.0161 0.2655 0.2447 0.2428 0.5607 1.9915 0.1800 0.1624 0.1208 0.0349 0.9819 0.8932 0.7540 0.3129 1.9304 1.0515 2.7296 2.0343 0.1470 0.6870 2.0546 20.5714 20.6734 31.2516 171.0704 35.4747 4.5785 2.8966 6.3930 7.4538 1.1700 1.2026 26.4685 2.1874 11.4127 20.2395 13.0398 9.7118 3.8381 7.6180 3.1019 2.2433 13.6873 1.4159 11.4021 2.6583 47.4385 14.8064 27.6088 5.6207 20.0882 20.0885 39.4972 74.7472 5.0306 19.8032 9.8668 63.0442 0.7055 32.7024 29.3757 2.4171 15.7092 12.9962 6.2161 1.1554 18.8964 0.3078 4.4657 0.9314 22.2175 21.8092 1.5566 38.2048 2.1965 16.6171 168.0736 11.0801 9.0437 230.5323 77.8384 49.9969 0.3734 0.0347 6.4493 36.5462 6.8020 25.9556 94.5109 3.4174 33.2410 200.4034 4.3270 1.4086 66.3827 32.1902 5.3899 9.0252 6.5500 74.5266 12.9432 98.5673 20.9860 47.8799 3.2448 35.2031 9.4448 151.1747 58.0475 56.1069 264.4610 57.9487 17.5151 104.1703 109.7563 301.2835 90.8001 8.8486 23.6152 7.4682 8.6186 13.4773 8.3944 6.1342 8.8224 12.9520 35.9532 37.3465 4.9697 5.0503 0.0943 4.8305 41.5913 29.4739
temp: 298.150 k
press: 1.00000 atm
elementType: 35 35 8 8 8 7 7 7 6 6 6 6 6 6 6 6 6 6 6 6 6 6 6 6 6 6 6 6 6 6 1 1 1 1 1 1 1 1 1 1 1 1 1 1 1 1 1
symmnumber: 1
zpe: 896180.4 jmol-1
zpe.correction: 0.341337 hartree
zpe.thermalcorrener: 0.368660 hartree
zpe.thermalcorrenthalpy: 0.369604 hartree
zpe.thermalcorrgfe: 0.279410 hartree
zpe.sumelectzpe: -1263.266105 hartree
zpe.sumelectthermal: -1263.238783 hartree
zpe.sumelectthermalent: -1263.237839 hartree
zpe.sumelectthermalfe: -1263.328033 hartree
dipole: 0.9610 0.9479 -2.8765
dipole: 3.1775
quadrupole: -192.2935 -179.3800 -190.3506
quadrupole: -13.0805 -4.4889 -11.5257
quadrupole: -4.9522 7.9613 -3.0092 -13.0805 -4.4889 -11.5257
hfenergy: -1263.6074424 hartree
pointgroup: C01 [X(C22H17Br2N3O3)]
dipole: -0.4824902 0.6151449 0.9754938 debye
polarizability: 386.815251|48.3178357|321.6268684|25.7254271|-43.8857409|245.7449518 unknown
InChI: InChI=1S/C22H17Br2N3O3/c1-13-25-21-18(9-15(23)10-19(21)24)22(30)27(13)26(16-5-3-2-4-6-16)12-14-7-8-17(28)11-20(14)29/h2-11,28-29H,12H2,1H3
charge 0 multiplicity 1
47 atoms
Br 5.573976 -0.298623 1.847672
Br 4.559632 3.053409 -2.754355
O  -0.18693 0.471799 -1.325472
O  -0.424108 2.023329 1.622142
O  -3.997846 4.493126 -0.713164
N  -1.037971 -1.244918 0.678467
N  0.313191 -0.854056 0.557945
N  2.523603 -0.981496 1.490503
C  -1.887852 -0.38448 1.54703
C  -1.512984 -2.268612 -0.184229
C  1.252716 -1.355278 1.486955
C  0.664385 0.071916 -0.491335
C  -2.437313 0.896755 0.93224
C  2.089163 0.472161 -0.471934
C  2.961572 -0.06189 0.532322
C  -1.686726 2.098809 0.996286
C  0.773225 -2.367671 2.493922
C  -2.887286 -2.640992 -0.194108
C  -0.608661 -2.99072 -1.015334
C  -3.708256 0.96061 0.313007
C  2.546799 1.389804 -1.449965
C  4.322547 0.375626 0.515624
C  -2.173516 3.31315 0.466526
C  3.888626 1.784988 -1.421044
C  -4.22198 2.153117 -0.23203
C  4.789642 1.287613 -0.444651
C  -3.331388 -3.709058 -1.00104
C  -1.069413 -4.051657 -1.819609
C  -3.444324 3.32933 -0.155916
C  -2.432337 -4.426886 -1.820671
H  -1.268893 -0.119739 2.422118
H  -2.71556 -1.016433 1.912227
H  1.641239 -2.692289 3.085059
H  0.312997 -3.239317 1.995864
H  0.013406 -1.942535 3.173796
H  -3.618108 -2.105391 0.416827
H  0.450749 -2.720033 -1.042988
H  -4.315515 0.051224 0.24869
H  1.83698 1.757278 -2.196142
H  -1.568689 4.22907 0.526313
H  -5.201063 2.191317 -0.715831
H  5.834698 1.606505 -0.439159
H  -4.394905 -3.974213 -0.990206
H  -0.35258 -4.58643 -2.452981
H  -2.784908 -5.25073 -2.449166
H  0.020369 2.905939 1.641886
H  -3.370604 5.255574 -0.65199
