program: Orca
programVersion: 5.0.2
elementType: O O O O N C C C C C C C C C C C C C C C C C C C H H H H H H H H H H H H H H H H H H H H H H H H H
charge: 0
multiplicity: 1
keywords: wb97x-d3
keywords: def2-TZVPP
keywords: def2/J RIJCOSX
keywords: DEFGRID2
keywords: scfconv7
keywords: smallprint printgap noloewdin
keywords: NOSOSCF
formula: C19H25NO4
InChI: InChI=1/C19H25NO4/c1-11(2)9-14-15(19(14,3)4)18(23)24-10-20-16(21)12-7-5-6-8-13(12)17(20)22/h9,14-15H,5-8,10H2,1-4H3
49 atoms
O  1.030283 -1.544012 -0.867282
O  2.012021 -1.484339 1.148487
O  -1.974831 -2.041814 -2.565408
O  -1.097147 -0.455838 1.599697
N  -1.258828 -1.52957 -0.434234
C  4.279215 0.138134 -0.221954
C  3.224185 1.136613 0.102534
C  2.856945 -0.150641 -0.655431
C  5.213865 0.477855 -1.360515
C  4.954556 -0.660849 0.865374
C  2.749408 1.390082 1.483719
C  1.967596 -1.117101 0.002205
C  1.591954 1.990415 1.773049
C  -0.0650 -2.310914 -0.393045
C  1.187748 2.277653 3.185216
C  0.621986 2.431596 0.715798
C  -3.135569 -0.425371 -1.187557
C  -2.880494 0.039084 0.036201
C  -4.268611 -0.001892 -2.045229
C  -3.701484 1.045263 0.754022
C  -4.900967 1.268191 -1.471779
C  -5.050063 1.20184 0.047994
C  -2.096755 -1.425102 -1.53886
C  -1.657959 -0.630673 0.548464
H  3.188731 2.004738 -0.550307
H  2.655871 -0.018647 -1.711985
H  5.599646 -0.426635 -1.835197
H  4.721286 1.072928 -2.130754
H  6.068165 1.052129 -0.99638
H  4.324749 -0.868745 1.725082
H  5.305062 -1.617889 0.47454
H  5.829903 -0.115237 1.22356
H  3.402847 1.09929 2.300282
H  0.0994 -2.675051 0.618694
H  -0.179399 -3.162819 -1.059109
H  0.280836 1.726416 3.448322
H  1.965099 2.009747 3.901006
H  0.954631 3.337475 3.319963
H  -0.401053 2.430901 1.094822
H  0.832423 3.456639 0.396643
H  0.650475 1.802499 -0.174273
H  -3.929325 0.160026 -3.071268
H  -5.003165 -0.812229 -2.096243
H  -3.840151 0.749541 1.796644
H  -3.163513 1.998607 0.781963
H  -4.283193 2.130415 -1.738188
H  -5.875865 1.429371 -1.934352
H  -5.693739 0.357967 0.312297
H  -5.549855 2.100547 0.412248
elementType: O N C H
totalener: -1094.87584855 hartree
nucrepener: 2168.22952164 hartree
electener: -3263.10537019 hartree
oneelecener: -5799.26573976 hartree
twoeener: 2536.16036958 hartree
cpcmener: -0.03365229 hartree
kineticenergy: 1090.03883082 hartree
xcener: -105.970891647614 hartree
chargesum: -0.0000000
charge: -0.287074 -0.446254 -0.410144 -0.406640 -0.084909 0.140220 -0.023910 -0.105767 -0.262753 -0.297155 -0.263794 0.383374 -0.011160 0.075731 -0.212067 -0.303046 -0.081071 -0.043575 -0.070614 -0.073270 -0.136480 -0.135654 0.321872 0.283203 0.113128 0.093524 0.095995 0.086249 0.094427 0.093638 0.099892 0.098939 0.122997 0.134454 0.127105 0.089097 0.087002 0.097725 0.084657 0.122186 0.097750 0.093994 0.100411 0.095813 0.102378 0.078275 0.080948 0.079076 0.081276
qa: -0.2871 -0.4463 -0.4101 -0.4066 -0.0849 0.1402 -0.0239 -0.1058 -0.2628 -0.2972 -0.2638 0.3834 -0.0112 0.0757 -0.2121 -0.3030 -0.0811 -0.0436 -0.0706 -0.0733 -0.1365 -0.1357 0.3219 0.2832 0.1131 0.0935 0.0960 0.0862 0.0944 0.0936 0.0999 0.0989 0.1230 0.1345 0.1271 0.0891 0.0870 0.0977 0.0847 0.1222 0.0977 0.0940 0.1004 0.0958 0.1024 0.0783 0.0809 0.0791 0.0813
va: 2.1022 2.0475 2.1070 2.0961 3.0952 3.7605 3.8040 3.8332 3.8956 3.8932 3.8344 4.1234 3.6921 3.8899 3.9152 3.9624 3.6942 3.6362 3.9190 3.9172 3.9171 3.9177 4.2186 4.2032 1.0024 1.0315 1.0025 1.0044 1.0024 1.0179 1.0004 0.9986 1.0020 1.0201 1.0098 1.0013 1.0091 0.9947 1.0051 0.9979 0.9984 1.0153 1.0044 1.0155 1.0055 1.0067 1.0094 1.0067 1.0094
dispcorr: -0.025937721 hartree
energy: -1094.901786268274
dipole: 7.41690 -8.78856 -1.37166 18.67412 -17.22701 1.44711 4.55744 -5.40160 -0.84416
magnitude: 2.16522 au
magnitude: 5.50355 debye
