program: Gaussian 09
title: 000063909
version: EM64L-G09RevD.01
frameworkgroup: C1[X(C26H23FN4O2S)]
method: RPBEPBE
basis: SDD
operation: Freq
keyword: #p
keyword: freq=noraman
keyword: PBEPBE/SDD
title: #p freq=noraman PBEPBE/SDD
converged: YES YES NO NO
title: Mulliken charges:
elementType: S F O O N N N N C C C C C C C C C C C C C C C C C C C C C C C C C C H H H H H H H H H H H H H H H H H H H H H H H
charge: 0.265232 -0.200249 -0.281397 -0.220585 -0.177623 -0.109139 -0.305762 -0.007947 -0.411309 -0.391448 -0.380676 -0.403050 0.439452 0.263962 -0.766965 -0.365398 -0.371809 -0.228875 -0.227873 -0.276214 -0.268767 0.142862 0.118865 0.097977 0.448967 -0.317135 -0.360154 -0.459450 -0.322491 -0.245332 -0.199696 0.358267 -0.168573 -0.379734 0.220075 0.232868 0.232926 0.219357 0.264268 0.229806 0.274577 0.233462 0.329652 0.315422 0.235977 0.225767 0.219227 0.219112 0.226014 0.273256 0.255336 0.274578 0.253047 0.238191 0.237237 0.239224 0.262685
chargesum: 0.00000
title: Mulliken charges with hydrogens summed into heavy atoms:
elementType: S F O O N N N N C C C C C C C C C C C C C C C C C C C C C C C C C C
charge: 0.265232 -0.200249 -0.281397 -0.220585 -0.177623 -0.109139 -0.305762 -0.007947 0.041634 0.060835 0.113399 0.104989 0.439452 0.263962 -0.121891 -0.129421 -0.146042 -0.009648 -0.008761 -0.276214 -0.042753 0.142862 0.118865 0.097977 0.448967 -0.043878 -0.104817 -0.184872 -0.069444 -0.007140 0.037541 0.358267 0.070652 -0.117049
polarizability: 3.86566821e+02 -3.63240507e+01 3.73384291e+02 1.88094762e+01 2.28685910e+01 2.77149814e+02
1716.lowfreq: -15.5784 -10.9873 -6.9199 -2.0889 -0.0012 0.0007 0.0008 2.1726 10.2028
frequency: -12.7675 -6.8611 7.1632 16.1102 19.4141 33.4565 45.8887 52.2229 62.3344 83.9112 90.5399 96.2249 120.3156 131.7251 158.3841 160.0019 171.3566 201.1533 218.4904 228.4303 240.5864 244.1299 254.4413 265.1906 283.6609 287.6053 314.9806 332.6517 345.7567 356.0485 409.1516 414.7213 423.8952 429.1441 449.4579 473.4840 488.0759 490.9071 499.5704 511.3044 513.7517 531.6842 532.6610 547.7359 560.8092 586.7258 593.7368 613.0036 616.2210 632.5148 645.3125 672.1452 685.9029 689.2842 690.9341 703.0994 716.2268 743.3321 752.3471 765.5825 779.6702 791.3123 794.5320 808.8229 837.2504 855.8644 865.1150 868.2035 889.5379 893.9427 906.1087 914.0002 914.9566 940.5113 953.3035 954.6961 973.2522 976.6498 977.9301 978.9512 981.3428 989.8353 1003.1002 1018.8636 1028.9706 1035.3385 1049.9579 1061.4059 1071.7185 1081.0357 1082.8503 1089.4973 1100.2059 1141.0015 1145.5046 1159.7581 1171.7124 1173.4035 1179.7083 1188.4799 1198.7682 1200.1718 1212.1284 1215.3806 1239.8193 1244.2659 1248.9467 1260.3140 1276.5046 1279.8413 1282.5843 1300.7225 1331.9216 1338.6618 1356.8677 1358.7634 1361.1505 1380.8722 1386.0232 1388.7583 1389.1274 1397.4361 1435.8676 1448.0011 1448.9034 1450.1892 1458.9347 1465.2277 1471.5895 1476.4986 1487.5317 1492.6756 1502.7198 1529.9521 1565.1142 1576.9449 1580.6088 1600.2328 1613.5860 1614.1561 1621.8150 1627.5085 2925.6851 2931.7892 2969.4456 2981.7481 3012.8793 3013.5116 3040.2015 3063.9787 3076.8705 3121.8364 3127.8784 3133.4703 3138.1367 3149.1360 3151.5934 3153.4114 3153.7325 3164.7528 3167.9169 3171.8212 3174.9657 3182.3053 3185.8185
redmass: 4.6697 6.3806 6.0104 6.7385 4.9900 6.8980 5.1531 6.2593 6.0014 4.9937 5.8367 4.3630 8.2624 4.7896 5.8741 4.0521 4.4711 4.3790 5.0741 5.6981 5.9914 4.7637 3.6040 3.4493 5.1994 3.1508 4.8836 3.5677 8.4228 9.3225 3.1670 3.0077 3.8469 4.0678 3.1562 4.6177 3.6725 3.2926 8.7228 2.8456 6.7388 7.9234 4.0720 8.0316 6.9049 7.9277 3.2888 5.5612 3.8232 7.9899 5.5845 6.6472 4.2071 2.6571 1.8133 3.0091 4.4920 7.0398 1.8885 4.3210 1.7132 2.7087 1.5814 1.2643 6.9064 1.5046 2.1906 1.5245 2.5385 1.4937 1.5544 3.7987 2.0437 5.9085 1.6383 1.8776 1.4545 3.9920 1.3459 1.3729 2.1375 6.2548 1.3346 2.4455 2.4986 2.1945 2.4072 1.8844 2.0864 1.5792 2.0602 1.6241 2.0039 2.0625 1.1767 1.4596 1.0553 1.1856 2.9686 2.5205 1.2022 1.5435 2.2400 1.1959 1.3376 1.5344 3.8451 1.6156 1.5431 1.7541 1.4596 3.3448 1.4149 1.3509 1.5915 1.6585 1.4410 2.0552 9.8550 4.5311 6.7863 3.2477 3.1380 2.2181 2.3926 1.2206 2.6229 1.1460 2.6357 1.1128 1.1796 1.1070 2.1065 10.4719 6.9809 6.0546 8.2051 6.9923 7.0766 7.6401 6.1120 10.4350 1.0684 1.0699 1.0663 1.0677 1.0713 1.0860 1.0921 1.0953 1.0954 1.0843 1.0881 1.1015 1.0863 1.0912 1.0898 1.0948 1.0877 1.0953 1.1009 1.0938 1.1006 1.0945 1.0988
irintensity: 1.7223 0.2018 1.2419 0.1520 0.3753 0.8356 0.9051 1.9070 3.3187 0.5480 0.7691 0.5753 3.4833 3.4122 0.4227 3.9188 1.8442 3.7407 1.3490 0.4703 1.7682 5.3151 1.1133 1.2663 0.7412 5.7970 1.4130 6.2124 2.0013 13.3472 9.3392 1.8125 0.5435 3.4663 5.9019 3.4967 5.3945 0.1900 5.3385 8.7428 5.4681 2.1360 1.9732 5.9858 5.8720 8.6110 1.6586 3.7516 13.8561 3.8994 5.8618 4.2892 17.4253 27.2558 40.6955 4.1526 1.4927 2.8773 78.7006 36.1626 71.8405 8.2025 22.4574 0.0676 27.1225 1.1272 31.8560 4.6867 5.7461 0.6035 14.6010 9.3728 2.8434 11.1269 8.2235 12.8162 0.4805 10.3243 0.0455 2.7401 13.0737 4.4696 0.0075 23.5533 31.9012 2.3197 13.2607 5.0149 3.7147 12.7943 4.1589 4.4502 11.1230 87.5604 51.1948 37.7884 0.4864 14.0849 16.7979 136.7447 4.5295 3.5039 30.0867 97.4910 14.9317 12.3080 60.5502 33.5130 10.6985 14.9182 62.2573 39.4592 3.3430 1.0226 21.8824 43.7618 33.3565 112.0358 2.1791 36.0435 21.4846 138.2901 25.4389 1.9353 4.6993 55.4787 99.4241 51.0424 54.7238 62.8612 62.9258 16.4970 102.0742 512.5586 2.7858 13.1741 325.4845 55.0005 83.4859 74.0257 223.2072 221.2576 88.7254 28.1046 28.7136 21.6208 49.4292 21.0295 18.6917 10.6556 8.6943 11.4559 7.6429 6.1469 3.6890 35.0891 5.1946 39.4393 6.4159 9.8565 10.1621 3.5229 22.6522 0.5430 3.4796
temp: 298.150 k
press: 1.00000 atm
elementType: 16 9 8 8 7 7 7 7 6 6 6 6 6 6 6 6 6 6 6 6 6 6 6 6 6 6 6 6 6 6 6 6 6 6 1 1 1 1 1 1 1 1 1 1 1 1 1 1 1 1 1 1 1 1 1 1 1
symmnumber: 1
zpe: 1149271.4 jmol-1
zpe.correction: 0.437734 hartree
zpe.thermalcorrener: 0.465560 hartree
zpe.thermalcorrenthalpy: 0.466504 hartree
zpe.thermalcorrgfe: 0.375951 hartree
zpe.sumelectzpe: -1869.543469 hartree
zpe.sumelectthermal: -1869.515643 hartree
zpe.sumelectthermalent: -1869.514699 hartree
zpe.sumelectthermalfe: -1869.605252 hartree
dipole: 0.1386 3.0311 -1.4042
dipole: 3.3435
quadrupole: -200.4639 -201.6907 -215.2725
quadrupole: -7.4778 -5.8911 -8.8971
quadrupole: 5.3452 4.1183 -9.4635 -7.4778 -5.8911 -8.8971
hfenergy: -1869.9812029 hartree
pointgroup: C01 [X(C26H23F1N4O2S1)]
dipole: 0.6955212 -0.7337251 -0.8415581 debye
polarizability: 337.002821|50.4118112|305.8837487|12.6456667|32.4877775|394.214356 unknown
InChI: InChI=1S/C26H23FN4O2S/c27-19-7-6-10-21(17-19)31-25(33)22-11-4-5-12-23(22)28-26(31)34-18-24(32)30-15-13-29(14-16-30)20-8-2-1-3-9-20/h1-12,17H,13-16,18H2
charge 0 multiplicity 1
57 atoms
S  1.009534 -0.115018 2.526284
F  0.999047 5.250133 3.004069
O  -1.63421 -2.250257 3.723533
O  4.185065 2.559186 -0.416523
N  -3.988575 -1.174934 -0.606705
N  -2.066714 -1.517003 1.556178
N  2.723244 1.218922 0.846845
N  1.898515 -0.887229 0.033026
C  -2.746047 -0.38677 -0.552771
C  -4.279411 -2.045877 0.550201
C  -1.632817 -1.15442 0.186118
C  -3.527644 -1.560779 1.800289
C  -4.873617 -1.095014 -1.694481
C  -1.208392 -1.88946 2.578385
C  0.293238 -1.869997 2.29122
C  -5.924792 -2.052165 -1.854465
C  -4.760187 -0.059518 -2.674612
C  -6.81316 -1.971039 -2.945789
C  -5.651464 0.001003 -3.764904
C  1.960249 0.045649 0.957975
C  -6.687589 -0.949563 -3.915412
C  3.445321 0.441952 -1.367861
C  3.515012 1.495308 -0.337612
C  2.641545 -0.722527 -1.148478
C  2.767753 2.19923 1.925056
C  4.179621 0.584267 -2.573848
C  2.589891 -1.731874 -2.147985
C  1.837008 3.259584 1.931251
C  3.754442 2.081023 2.928159
C  4.119367 -0.41911 -3.555032
C  3.322348 -1.578467 -3.337184
C  1.921014 4.187452 2.981333
C  3.804393 3.036957 3.965927
C  2.880444 4.105697 4.004805
H  -2.900328 0.603746 -0.070481
H  -2.387663 -0.199437 -1.580862
H  -5.363996 -2.014695 0.770986
H  -4.015197 -3.106379 0.34323
H  -0.728915 -0.523628 0.226808
H  -1.378554 -2.066501 -0.391776
H  -3.703637 -2.238406 2.652311
H  -3.89234 -0.556381 2.094613
H  0.589476 -2.158239 1.267488
H  0.788407 -2.505191 3.038206
H  -6.036134 -2.87608 -1.142811
H  -3.998883 0.720452 -2.573559
H  -7.605457 -2.722794 -3.042458
H  -5.540937 0.810138 -4.496538
H  -7.378861 -0.893978 -4.762416
H  4.784183 1.487061 -2.708864
H  1.974407 -2.617488 -1.963552
H  1.082975 3.367507 1.147443
H  4.470804 1.255309 2.890397
H  4.68469 -0.312305 -4.486359
H  3.279943 -2.359372 -4.104275
H  4.564696 2.952447 4.748275
H  2.899288 4.85787 4.798401
