program: Orca
programVersion: 5.0.2
elementType: O O O O N C C C C C C C C C C C C C C C C C C C H H H H H H H H H H H H H H H H H H H H H H H H H
charge: 0
multiplicity: 1
keywords: wb97x-d3
keywords: def2-TZVPP
keywords: def2/J RIJCOSX
keywords: DEFGRID2
keywords: scfconv7
keywords: smallprint printgap noloewdin
keywords: NOSOSCF
formula: C19H25NO4
InChI: InChI=1/C19H25NO4/c1-11(2)9-14-15(19(14,3)4)18(23)24-10-20-16(21)12-7-5-6-8-13(12)17(20)22/h9,14-15H,5-8,10H2,1-4H3
49 atoms
O  1.185956 -0.949741 -0.489306
O  2.669104 -2.143443 -1.642352
O  -1.495088 0.423419 -2.261668
O  -1.268941 -2.32331 1.358483
N  -1.088785 -1.155096 -0.625338
C  3.531754 -0.183342 1.330831
C  3.363844 0.927925 0.349042
C  3.486818 -0.505286 -0.15272
C  4.887113 -0.353798 1.97759
C  2.394814 -0.558401 2.2505
C  2.128692 1.751016 0.28442
C  2.430846 -1.282147 -0.835433
C  1.572867 2.245966 -0.820852
C  0.139294 -1.689353 -1.100123
C  0.37512 3.144629 -0.753893
C  2.071342 1.955644 -2.202321
C  -2.891368 0.23703 -0.293033
C  -2.838426 -0.582641 0.756568
C  -3.908779 1.298868 -0.495541
C  -3.80735 -0.596178 1.880313
C  -4.670774 1.532205 0.810985
C  -5.044817 0.21732 1.495706
C  -1.770253 -0.093925 -1.213887
C  -1.662923 -1.480656 0.602444
H  4.270499 1.497518 0.153852
H  4.450154 -0.75312 -0.583558
H  5.699321 -0.076374 1.304566
H  4.969017 0.271355 2.868774
H  5.048195 -1.389501 2.281661
H  2.429394 -1.620471 2.49814
H  2.487244 -0.002164 3.185733
H  1.41255 -0.34855 1.838823
H  1.685918 2.012947 1.241384
H  0.205145 -2.743857 -0.831619
H  0.175053 -1.592934 -2.185134
H  0.608311 4.133658 -1.156885
H  -0.444912 2.749778 -1.357237
H  0.017735 3.276663 0.267234
H  1.295424 1.453647 -2.785835
H  2.306796 2.88262 -2.731364
H  2.963136 1.332364 -2.215177
H  -3.432343 2.218797 -0.842503
H  -4.592631 0.999851 -1.296476
H  -4.074391 -1.624103 2.135877
H  -3.332297 -0.183633 2.776192
H  -4.049761 2.126285 1.487679
H  -5.567007 2.122589 0.615364
H  -5.668946 -0.376077 0.821282
H  -5.648442 0.413416 2.382954
totalener: -1094.84960488 hartree
nucrepener: 2201.12588886 hartree
electener: -3295.97549374 hartree
oneelecener: -5863.94665343 hartree
twoeener: 2567.97115969 hartree
kineticenergy: 1090.09604435 hartree
xcener: -105.972258323609 hartree
chargesum: -0.0000000
charge: -0.247969 -0.363007 -0.330648 -0.315119 -0.092940 0.131296 -0.026514 -0.140846 -0.247708 -0.272805 -0.199037 0.335183 -0.006583 0.061590 -0.230866 -0.252197 -0.052339 -0.072462 -0.071630 -0.075523 -0.131937 -0.135304 0.217419 0.237572 0.098845 0.092746 0.071599 0.084992 0.093280 0.099409 0.086363 0.086128 0.087606 0.128148 0.129271 0.096763 0.083062 0.076162 0.097987 0.093655 0.088640 0.092982 0.094872 0.094358 0.093486 0.075329 0.080250 0.076007 0.080436
qa: -0.2480 -0.3630 -0.3306 -0.3151 -0.0929 0.1313 -0.0265 -0.1408 -0.2477 -0.2728 -0.1990 0.3352 -0.0066 0.0616 -0.2309 -0.2522 -0.0523 -0.0725 -0.0716 -0.0755 -0.1319 -0.1353 0.2174 0.2376 0.0988 0.0927 0.0716 0.0850 0.0933 0.0994 0.0864 0.0861 0.0876 0.1281 0.1293 0.0968 0.0831 0.0762 0.0980 0.0937 0.0886 0.0930 0.0949 0.0944 0.0935 0.0753 0.0803 0.0760 0.0804
va: 2.0878 2.1425 2.1708 2.1922 3.1107 3.7053 3.8147 3.8568 3.9140 3.9299 3.8713 4.1944 3.7147 3.9159 3.9294 3.9437 3.6308 3.6477 3.9220 3.9234 3.8948 3.8996 4.2483 4.2559 1.0066 1.0271 1.0089 1.0043 1.0036 1.0058 0.9997 1.0077 1.0072 1.0035 1.0039 1.0012 1.0088 1.0080 1.0072 1.0029 1.0072 1.0169 1.0089 1.0184 1.0088 1.0094 1.0118 1.0087 1.0120
dispcorr: -0.027400678 hartree
energy: -1094.877005559759
dipole: 2.81920 -4.15638 -1.33718 16.17858 -15.06207 1.11651 9.27679 -8.32663 0.95016
magnitude: 1.98430 au
magnitude: 5.04369 debye
