program: Orca
programVersion: 5.0.2
elementType: O O O O N C C C C C C C C C C C C C C C C C C C H H H H H H H H H H H H H H H H H H H H H H H H H
charge: 0
multiplicity: 1
keywords: wb97x-d3
keywords: def2-TZVPP
keywords: def2/J RIJCOSX
keywords: DEFGRID2
keywords: scfconv7
keywords: smallprint printgap noloewdin
keywords: NOSOSCF
formula: C19H25NO4
InChI: InChI=1/C19H25NO4/c1-11(2)9-14-15(19(14,3)4)18(23)24-10-20-16(21)12-7-5-6-8-13(12)17(20)22/h9,14-15H,5-8,10H2,1-4H3
49 atoms
O  1.183824 -1.056191 -0.479633
O  2.694892 -2.166441 -1.681084
O  -1.435693 0.238665 -2.354595
O  -1.27358 -2.296534 1.418204
N  -1.082862 -1.267046 -0.639096
C  3.562768 -0.201804 1.270927
C  3.238316 0.921977 0.345288
C  3.459242 -0.476843 -0.218643
C  4.964059 -0.264124 1.833912
C  2.524656 -0.714292 2.239637
C  1.934151 1.631349 0.381857
C  2.432834 -1.319877 -0.866645
C  1.33896 2.217881 -0.656095
C  0.149354 -1.831189 -1.065787
C  0.077055 3.008554 -0.486027
C  1.859948 2.140959 -2.056705
C  -2.817643 0.221471 -0.367806
C  -2.780572 -0.532037 0.731096
C  -3.793908 1.310208 -0.622128
C  -3.723241 -0.426472 1.872366
C  -4.511788 1.66672 0.681247
C  -4.929653 0.420827 1.462889
C  -1.723875 -0.209955 -1.279286
C  -1.647536 -1.488272 0.615552
H  4.07751 1.577142 0.120869
H  4.413557 -0.625073 -0.710747
H  5.704739 0.116025 1.129431
H  5.038536 0.332745 2.74489
H  5.240359 -1.289706 2.084331
H  2.590491 -0.152717 3.173817
H  1.504261 -0.633445 1.878461
H  2.707105 -1.763099 2.478027
H  1.469196 1.72491 1.358668
H  0.210545 -2.867836 -0.733917
H  0.201725 -1.798072 -2.153604
H  0.240861 4.060009 -0.734989
H  -0.704364 2.650319 -1.159735
H  -0.301053 2.963386 0.534909
H  1.132156 1.644304 -2.702841
H  2.015574 3.139625 -2.471912
H  2.799951 1.59812 -2.131414
H  -3.288462 2.182288 -1.043244
H  -4.509651 0.986262 -1.384509
H  -4.032744 -1.420908 2.201331
H  -3.206777 0.019541 2.728417
H  -3.84716 2.275324 1.301147
H  -5.384752 2.284136 0.465014
H  -5.600548 -0.184212 0.846274
H  -5.498144 0.706412 2.348954
totalener: -1094.84953195 hartree
nucrepener: 2212.10396266 hartree
electener: -3306.95349461 hartree
oneelecener: -5885.84677592 hartree
twoeener: 2578.89328131 hartree
kineticenergy: 1090.11053260 hartree
xcener: -105.975052071368 hartree
chargesum: 0.0000000
charge: -0.249476 -0.363350 -0.325615 -0.315746 -0.092817 0.132355 -0.031649 -0.147110 -0.246292 -0.274221 -0.188303 0.346323 -0.008009 0.067433 -0.231746 -0.251112 -0.056194 -0.068914 -0.077742 -0.075751 -0.127431 -0.135349 0.205742 0.239423 0.098772 0.090927 0.071233 0.085401 0.093021 0.086939 0.088641 0.095809 0.087413 0.127319 0.127657 0.101194 0.071887 0.078033 0.101589 0.091944 0.086042 0.095857 0.096948 0.094357 0.093106 0.074799 0.080185 0.075698 0.080782
qa: -0.2495 -0.3633 -0.3256 -0.3157 -0.0928 0.1324 -0.0316 -0.1471 -0.2463 -0.2742 -0.1883 0.3463 -0.0080 0.0674 -0.2317 -0.2511 -0.0562 -0.0689 -0.0777 -0.0758 -0.1274 -0.1353 0.2057 0.2394 0.0988 0.0909 0.0712 0.0854 0.0930 0.0869 0.0886 0.0958 0.0874 0.1273 0.1277 0.1012 0.0719 0.0780 0.1016 0.0919 0.0860 0.0959 0.0969 0.0944 0.0931 0.0748 0.0802 0.0757 0.0808
va: 2.0888 2.1430 2.1735 2.1916 3.1115 3.7162 3.8122 3.8659 3.9137 3.9285 3.8645 4.1942 3.7238 3.9203 3.9309 3.9470 3.6061 3.6423 3.9206 3.9231 3.8891 3.8992 4.2503 4.2618 1.0067 1.0276 1.0088 1.0040 1.0039 0.9997 1.0089 1.0059 1.0066 1.0012 1.0066 1.0007 1.0097 1.0080 1.0062 1.0025 1.0070 1.0142 1.0093 1.0179 1.0090 1.0107 1.0120 1.0088 1.0120
dispcorr: -0.027928155 hartree
energy: -1094.877460106426
dipole: 2.66616 -3.95170 -1.28553 17.17990 -15.98510 1.19480 9.66171 -8.70566 0.95605
magnitude: 1.99854 au
magnitude: 5.07989 debye
