program: Orca
programVersion: 5.0.2
elementType: O O O O N C C C C C C C C C C C C C C C C C C C H H H H H H H H H H H H H H H H H H H H H H H H H
charge: 0
multiplicity: 1
keywords: wb97x-d3
keywords: def2-TZVPP
keywords: def2/J RIJCOSX
keywords: DEFGRID2
keywords: scfconv7
keywords: smallprint printgap noloewdin
keywords: NOSOSCF
formula: C19H25NO4
InChI: InChI=1/C19H25NO4/c1-11(2)9-14-15(19(14,3)4)18(23)24-10-20-16(21)12-7-5-6-8-13(12)17(20)22/h9,14-15H,5-8,10H2,1-4H3
49 atoms
O  0.996888 -0.968432 -0.736458
O  2.509974 -1.734635 -2.177715
O  -1.719057 -3.168402 -0.049228
O  -1.397569 1.173544 -1.369964
N  -1.272305 -1.096571 -0.97035
C  3.160063 -0.194335 1.190699
C  3.357342 0.870765 0.151056
C  3.291688 -0.604157 -0.257028
C  4.361078 -0.536289 2.044564
C  1.866242 -0.288693 1.964929
C  2.309917 1.837703 -0.224542
C  2.253714 -1.157551 -1.154871
C  2.473362 3.151898 -0.400867
C  -0.039561 -1.376243 -1.619389
C  1.308139 4.012459 -0.79268
C  3.76352 3.895636 -0.234656
C  -3.081601 -1.231776 0.446308
C  -2.985961 0.041268 0.063083
C  -4.127016 -1.776573 1.347161
C  -3.893925 1.133137 0.494673
C  -5.255733 -0.75449 1.497648
C  -4.720428 0.664373 1.694307
C  -1.973875 -2.004344 -0.176947
C  -1.815203 0.179213 -0.843274
H  4.367946 1.259412 0.093597
H  4.255061 -1.020041 -0.529031
H  5.295403 -0.465748 1.485951
H  4.433415 0.142103 2.896581
H  4.285842 -1.553576 2.433348
H  1.011347 0.141027 1.45382
H  1.628628 -1.326385 2.203389
H  1.981974 0.248594 2.907917
H  1.311522 1.448655 -0.37943
H  0.017698 -2.444015 -1.828652
H  0.019853 -0.821773 -2.556245
H  1.507906 4.538479 -1.729804
H  0.395327 3.433112 -0.924304
H  1.117142 4.782344 -0.03993
H  3.670097 4.651255 0.549979
H  4.609704 3.262635 0.023421
H  4.018934 4.432406 -1.151671
H  -4.504057 -2.726162 0.960716
H  -3.679919 -2.010137 2.318884
H  -3.319429 2.030063 0.736692
H  -4.545022 1.415013 -0.339202
H  -5.885628 -0.781339 0.603682
H  -5.896783 -1.032956 2.335196
H  -4.098292 0.695172 2.59337
H  -5.546405 1.355901 1.866253
totalener: -1094.85016655 hartree
nucrepener: 2140.63113582 hartree
electener: -3235.48130236 hartree
oneelecener: -5742.84829322 hartree
twoeener: 2507.36699085 hartree
kineticenergy: 1090.09076072 hartree
xcener: -105.971125891085 hartree
chargesum: 0.0000000
charge: -0.267720 -0.360393 -0.313331 -0.330596 -0.107845 0.122971 0.025146 -0.106921 -0.250078 -0.234091 -0.191787 0.333829 -0.060400 0.067815 -0.204525 -0.242750 -0.090582 -0.056519 -0.071245 -0.075366 -0.136900 -0.135609 0.256426 0.234672 0.086036 0.087322 0.072264 0.086875 0.091121 0.072599 0.097920 0.081429 0.076234 0.127723 0.129614 0.080226 0.087821 0.077472 0.086027 0.076835 0.087757 0.094178 0.094378 0.094437 0.093508 0.076281 0.080626 0.076462 0.080651
qa: -0.2677 -0.3604 -0.3133 -0.3306 -0.1078 0.1230 0.0251 -0.1069 -0.2501 -0.2341 -0.1918 0.3338 -0.0604 0.0678 -0.2045 -0.2427 -0.0906 -0.0565 -0.0712 -0.0754 -0.1369 -0.1356 0.2564 0.2347 0.0860 0.0873 0.0723 0.0869 0.0911 0.0726 0.0979 0.0814 0.0762 0.1277 0.1296 0.0802 0.0878 0.0775 0.0860 0.0768 0.0878 0.0942 0.0944 0.0944 0.0935 0.0763 0.0806 0.0765 0.0807
va: 2.0929 2.1446 2.2005 2.1683 3.1084 3.6760 3.7533 3.8680 3.9211 3.9188 3.9230 4.2278 3.8282 3.9140 3.9279 3.9358 3.6448 3.6171 3.9216 3.9241 3.8980 3.8972 4.2637 4.2450 1.0105 1.0278 1.0085 1.0037 1.0035 1.0127 1.0042 1.0046 1.0136 1.0072 0.9989 0.9997 1.0186 0.9972 0.9989 1.0169 0.9991 1.0192 1.0089 1.0193 1.0080 1.0084 1.0119 1.0088 1.0116
dispcorr: -0.024462493 hartree
energy: -1094.874629039814
dipole: 6.19761 -7.47388 -1.27627 18.38487 -17.52183 0.86304 15.24407 -13.88673 1.35733
magnitude: 2.05331 au
magnitude: 5.21909 debye
