program: Orca
programVersion: 5.0.2
elementType: O O O O N C C C C C C C C C C C C C C C C C C C H H H H H H H H H H H H H H H H H H H H H H H H H
charge: 0
multiplicity: 1
keywords: wb97x-d3
keywords: def2-TZVPP
keywords: def2/J RIJCOSX
keywords: DEFGRID2
keywords: scfconv7
keywords: smallprint printgap noloewdin
keywords: NOSOSCF
formula: C19H25NO4
InChI: InChI=1/C19H25NO4/c1-11(2)9-14-15(19(14,3)4)18(23)24-10-20-16(21)12-7-5-6-8-13(12)17(20)22/h9,14-15H,5-8,10H2,1-4H3
49 atoms
O  1.002433 -1.734359 -0.928051
O  2.207139 -2.143244 0.920096
O  -2.06843 -1.916916 -2.536793
O  -0.935677 -0.782296 1.72273
N  -1.250854 -1.664347 -0.389919
C  4.120675 0.096118 0.015964
C  2.864946 0.918707 -0.107971
C  2.933413 -0.498601 -0.680372
C  5.264419 0.485419 -0.893538
C  4.595884 -0.376953 1.368933
C  1.987411 1.220293 1.036328
C  2.054439 -1.54494 -0.106388
C  1.352881 2.371822 1.273547
C  -0.097746 -2.5000 -0.471033
C  0.467019 2.516919 2.475225
C  1.443021 3.601534 0.420429
C  -3.001994 -0.299354 -0.999858
C  -2.660626 0.043097 0.241729
C  -4.098489 0.319986 -1.785055
C  -3.32535 1.094835 1.050003
C  -4.532031 1.625439 -1.114733
C  -4.658557 1.473118 0.401717
C  -2.092555 -1.380837 -1.464313
C  -1.518218 -0.804389 0.6747
H  2.896778 1.683527 -0.875446
H  2.974174 -0.5353 -1.764218
H  4.916079 0.83203 -1.867907
H  5.854592 1.288417 -0.448742
H  5.930519 -0.362446 -1.063848
H  5.232604 0.391733 1.810399
H  3.79839 -0.591339 2.071881
H  5.191283 -1.285046 1.267745
H  1.825436 0.418029 1.748043
H  0.103826 -2.939267 0.504353
H  -0.289546 -3.284948 -1.199993
H  -0.550163 2.790721 2.180467
H  0.405037 1.597257 3.053941
H  0.822265 3.314288 3.133279
H  2.085174 3.48903 -0.449953
H  0.453305 3.898589 0.064273
H  1.826986 4.443412 1.001914
H  -3.778195 0.491203 -2.815101
H  -4.937965 -0.380108 -1.848764
H  -3.466509 0.75434 2.078063
H  -2.664111 1.96555 1.116091
H  -3.79762 2.404286 -1.339304
H  -5.479302 1.961609 -1.538719
H  -5.398666 0.699622 0.626668
H  -5.034904 2.397666 0.841893
totalener: -1094.84956869 hartree
nucrepener: 2170.88947498 hartree
electener: -3265.73904367 hartree
oneelecener: -5803.72214172 hartree
twoeener: 2537.98309805 hartree
kineticenergy: 1090.09431475 hartree
xcener: -105.971474461300 hartree
chargesum: 0.0000000
charge: -0.261616 -0.350798 -0.319638 -0.316966 -0.111158 0.104817 0.037874 -0.090419 -0.248873 -0.235699 -0.235281 0.319509 -0.065794 0.069430 -0.212144 -0.239415 -0.101919 -0.043818 -0.074516 -0.080796 -0.135306 -0.134160 0.270761 0.230445 0.081460 0.087260 0.069722 0.089698 0.089600 0.080584 0.094552 0.088044 0.107978 0.139260 0.114181 0.062147 0.095441 0.094949 0.078331 0.079691 0.088843 0.094944 0.092012 0.099778 0.085984 0.075036 0.079717 0.076835 0.079433
qa: -0.2616 -0.3508 -0.3196 -0.3170 -0.1112 0.1048 0.0379 -0.0904 -0.2489 -0.2357 -0.2353 0.3195 -0.0658 0.0694 -0.2121 -0.2394 -0.1019 -0.0438 -0.0745 -0.0808 -0.1353 -0.1342 0.2708 0.2304 0.0815 0.0873 0.0697 0.0897 0.0896 0.0806 0.0946 0.0880 0.1080 0.1393 0.1142 0.0621 0.0954 0.0949 0.0783 0.0797 0.0888 0.0949 0.0920 0.0998 0.0860 0.0750 0.0797 0.0768 0.0794
va: 2.1152 2.1525 2.1940 2.1854 3.1011 3.7387 3.8124 3.8298 3.9093 3.9169 3.8954 4.2202 3.7838 3.8954 3.9334 3.9469 3.6568 3.5731 3.9233 3.9317 3.9050 3.9061 4.2732 4.2751 1.0091 1.0264 1.0071 1.0040 1.0047 1.0014 1.0189 1.0052 1.0241 1.0187 1.0078 0.9977 1.0162 1.0011 1.0171 0.9995 0.9992 1.0192 1.0077 1.0171 1.0089 1.0088 1.0115 1.0090 1.0112
dispcorr: -0.025440487 hartree
energy: -1094.875009171797
dipole: 7.79987 -8.76581 -0.96594 23.93733 -22.62426 1.31306 5.61700 -5.95790 -0.34090
magnitude: 1.66535 au
magnitude: 4.23299 debye
