program: Orca
programVersion: 5.0.2
elementType: O O O O N C C C C C C C C C C C C C C C C C C C H H H H H H H H H H H H H H H H H H H H H H H H H
charge: 0
multiplicity: 1
keywords: wb97x-d3
keywords: def2-TZVPP
keywords: def2/J RIJCOSX
keywords: DEFGRID2
keywords: scfconv7
keywords: smallprint printgap noloewdin
keywords: NOSOSCF
formula: C19H25NO4
InChI: InChI=1/C19H25NO4/c1-11(2)9-14-15(19(14,3)4)18(23)24-10-20-16(21)12-7-5-6-8-13(12)17(20)22/h9,14-15H,5-8,10H2,1-4H3
49 atoms
O  1.230541 -1.00422 -0.634738
O  2.742562 -1.993051 -1.942087
O  -1.572961 -0.151951 -2.603772
O  -0.975356 -1.931717 1.537524
N  -1.024693 -1.327432 -0.69085
C  3.764737 -0.175186 0.960298
C  3.140102 1.005835 0.293914
C  3.45413 -0.238224 -0.525192
C  5.231735 -0.091613 1.311146
C  2.975165 -1.001276 1.947469
C  1.776259 1.486747 0.635676
C  2.465536 -1.168247 -1.1119
C  0.983875 2.193452 -0.168981
C  0.21867 -1.879945 -1.103344
C  -0.341282 2.711558 0.301046
C  1.32261 2.510253 -1.59218
C  -2.831937 0.091334 -0.553284
C  -2.648899 -0.418064 0.664548
C  -3.903007 1.0466 -0.929722
C  -3.466218 -0.086556 1.858179
C  -4.940298 1.124617 0.192414
C  -4.284875 1.174317 1.573168
C  -1.770922 -0.431476 -1.454036
C  -1.469715 -1.323364 0.629662
H  3.835368 1.812477 0.07138
H  4.325498 -0.167086 -1.166427
H  5.791357 0.504272 0.589046
H  5.366132 0.367396 2.292573
H  5.683896 -1.084442 1.343216
H  3.08966 -0.585247 2.95045
H  1.910643 -1.05418 1.735206
H  3.35655 -2.023547 1.976521
H  1.430408 1.279939 1.644121
H  0.344982 -2.872433 -0.669468
H  0.230277 -1.958612 -2.190021
H  -0.365566 3.804282 0.279496
H  -1.149858 2.373361 -0.351626
H  -0.571535 2.390206 1.316864
H  2.311912 2.161152 -1.881105
H  0.598391 2.046584 -2.26737
H  1.276798 3.586337 -1.777353
H  -3.459381 2.030199 -1.118315
H  -4.364332 0.747895 -1.873784
H  -4.121762 -0.929335 2.10027
H  -2.822576 0.047485 2.730439
H  -5.576404 1.998695 0.046241
H  -5.59686 0.251398 0.137298
H  -5.044691 1.30559 2.344884
H  -3.628389 2.047915 1.630772
totalener: -1094.84800471 hartree
nucrepener: 2226.83110808 hartree
electener: -3321.67911279 hartree
oneelecener: -5915.22382872 hartree
twoeener: 2593.54471593 hartree
kineticenergy: 1090.10803920 hartree
xcener: -105.974566322305 hartree
chargesum: 0.0000000
charge: -0.246347 -0.360755 -0.317996 -0.320529 -0.095195 0.121093 -0.032430 -0.139352 -0.245173 -0.280793 -0.166700 0.349299 -0.022863 0.062714 -0.232654 -0.252171 -0.124070 -0.035839 -0.065908 -0.082423 -0.128512 -0.135506 0.232714 0.235213 0.098857 0.087179 0.070831 0.085661 0.092954 0.087575 0.096098 0.094407 0.091544 0.127467 0.128788 0.106460 0.063981 0.080478 0.084911 0.098788 0.091902 0.093125 0.099695 0.095478 0.094500 0.080395 0.076151 0.082181 0.074778
qa: -0.2463 -0.3608 -0.3180 -0.3205 -0.0952 0.1211 -0.0324 -0.1394 -0.2452 -0.2808 -0.1667 0.3493 -0.0229 0.0627 -0.2327 -0.2522 -0.1241 -0.0358 -0.0659 -0.0824 -0.1285 -0.1355 0.2327 0.2352 0.0989 0.0872 0.0708 0.0857 0.0930 0.0876 0.0961 0.0944 0.0915 0.1275 0.1288 0.1065 0.0640 0.0805 0.0849 0.0988 0.0919 0.0931 0.0997 0.0955 0.0945 0.0804 0.0762 0.0822 0.0748
va: 2.0857 2.1451 2.1832 2.1863 3.1010 3.7493 3.8070 3.8656 3.9128 3.9267 3.8553 4.2034 3.7267 3.9221 3.9511 3.9530 3.6153 3.5714 3.9185 3.9240 3.8886 3.8929 4.2382 4.2540 1.0059 1.0285 1.0086 1.0037 1.0042 1.0005 1.0100 1.0045 1.0062 0.9971 1.0113 1.0007 0.9971 1.0089 1.0073 1.0058 1.0018 1.0079 1.0197 1.0072 1.0198 1.0125 1.0091 1.0128 1.0116
dispcorr: -0.028939658 hartree
energy: -1094.876944366572
dipole: 2.16314 -3.40978 -1.24664 17.10838 -15.96599 1.14239 10.84280 -9.83238 1.01042
magnitude: 1.96980 au
magnitude: 5.00683 debye
