program: Orca
programVersion: 5.0.2
elementType: O O O O N C C C C C C C C C C C C C C C C C C C H H H H H H H H H H H H H H H H H H H H H H H H H
charge: 0
multiplicity: 1
keywords: wb97x-d3
keywords: def2-TZVPP
keywords: def2/J RIJCOSX
keywords: DEFGRID2
keywords: scfconv7
keywords: smallprint printgap noloewdin
keywords: NOSOSCF
formula: C19H25NO4
InChI: InChI=1/C19H25NO4/c1-11(2)9-14-15(19(14,3)4)18(23)24-10-20-16(21)12-7-5-6-8-13(12)17(20)22/h9,14-15H,5-8,10H2,1-4H3
49 atoms
O  0.610231 -1.24274 -0.518705
O  1.983526 -1.070214 1.244558
O  -2.288665 -3.022662 -1.70773
O  -1.603881 0.178898 1.450583
N  -1.614462 -1.602574 -0.015534
C  3.872105 0.493105 -0.638185
C  2.906735 1.531407 -0.161752
C  2.384132 0.222949 -0.736358
C  4.561363 0.748019 -1.95858
C  4.741148 -0.243506 0.349988
C  2.729837 1.891403 1.269457
C  1.683425 -0.74773 0.128113
C  3.574702 2.663336 1.953412
C  -0.287127 -2.070999 0.201763
C  3.31012 3.033396 3.381141
C  4.838136 3.224958 1.374402
C  -3.66659 -1.175897 -0.965012
C  -3.468892 -0.239139 -0.037338
C  -4.880585 -1.296601 -1.81105
C  -4.419346 0.85276 0.289494
C  -5.993104 -0.413419 -1.241576
C  -5.472726 0.959848 -0.815223
C  -2.479503 -2.073376 -1.000217
C  -2.140943 -0.465974 0.593879
H  2.758987 2.364306 -0.846044
H  1.961072 0.292669 -1.731488
H  4.867402 -0.187932 -2.429037
H  3.918597 1.27895 -2.662479
H  5.458554 1.35287 -1.810267
H  4.289208 -0.341578 1.331344
H  4.977788 -1.243725 -0.017032
H  5.684048 0.294582 0.468044
H  1.83575 1.535803 1.769945
H  -0.058152 -2.059236 1.266048
H  -0.215318 -3.089431 -0.177981
H  3.234698 4.11774 3.499564
H  2.388818 2.58866 3.754767
H  4.128147 2.705958 4.027621
H  4.995312 2.93655 0.336674
H  4.833765 4.317481 1.421874
H  5.70818 2.894556 1.948159
H  -4.636275 -1.001816 -2.836794
H  -5.198412 -2.33981 -1.872754
H  -4.889867 0.646992 1.256512
H  -3.883072 1.79579 0.417516
H  -6.788992 -0.300456 -1.979399
H  -6.441091 -0.912707 -0.377321
H  -6.29989 1.585925 -0.477436
H  -5.034922 1.465626 -1.680799
totalener: -1094.85131480 hartree
nucrepener: 2079.39780194 hartree
electener: -3174.24911674 hartree
oneelecener: -5620.91178383 hartree
twoeener: 2446.66266709 hartree
kineticenergy: 1090.08933977 hartree
xcener: -105.970524439950 hartree
chargesum: -0.0000000
charge: -0.275444 -0.375391 -0.319992 -0.319328 -0.113625 0.072734 -0.043353 -0.069398 -0.240686 -0.259973 -0.169007 0.339845 -0.028790 0.068302 -0.209550 -0.253554 -0.103200 -0.067397 -0.072781 -0.075706 -0.134833 -0.135340 0.270223 0.250495 0.099049 0.082869 0.093438 0.072626 0.082477 0.116983 0.093124 0.077518 0.097165 0.138865 0.113426 0.081883 0.084723 0.082421 0.077897 0.095673 0.091100 0.093064 0.093771 0.092943 0.094653 0.079750 0.074881 0.080142 0.075308
qa: -0.2754 -0.3754 -0.3200 -0.3193 -0.1136 0.0727 -0.0434 -0.0694 -0.2407 -0.2600 -0.1690 0.3398 -0.0288 0.0683 -0.2095 -0.2536 -0.1032 -0.0674 -0.0728 -0.0757 -0.1348 -0.1353 0.2702 0.2505 0.0990 0.0829 0.0934 0.0726 0.0825 0.1170 0.0931 0.0775 0.0972 0.1389 0.1134 0.0819 0.0847 0.0824 0.0779 0.0957 0.0911 0.0931 0.0938 0.0929 0.0947 0.0798 0.0749 0.0801 0.0753
va: 2.1088 2.1162 2.1945 2.1894 3.0890 3.7200 3.8799 3.8508 3.9034 3.9058 3.8859 4.1612 3.7481 3.8922 3.9392 3.9394 3.6561 3.6105 3.9252 3.9249 3.8975 3.8990 4.2775 4.2797 1.0043 1.0304 1.0051 1.0077 1.0063 1.0162 1.0055 0.9996 1.0270 1.0147 1.0097 0.9976 1.0117 0.9991 1.0092 1.0035 0.9985 1.0085 1.0192 1.0081 1.0193 1.0118 1.0086 1.0117 1.0088
dispcorr: -0.023448772 hartree
energy: -1094.874763571701
dipole: 16.77113 -17.79568 -1.02455 19.42361 -18.58608 0.83754 1.59241 -2.24133 -0.64892
magnitude: 1.47386 au
magnitude: 3.74625 debye
