program: Orca
programVersion: 5.0.2
elementType: O O O O N C C C C C C C C C C C C C C C C C C C H H H H H H H H H H H H H H H H H H H H H H H H H
charge: 0
multiplicity: 1
keywords: wb97x-d3
keywords: def2-TZVPP
keywords: def2/J RIJCOSX
keywords: DEFGRID2
keywords: scfconv7
keywords: smallprint printgap noloewdin
keywords: NOSOSCF
formula: C19H25NO4
InChI: InChI=1/C19H25NO4/c1-11(2)9-14-15(19(14,3)4)18(23)24-10-20-16(21)12-7-5-6-8-13(12)17(20)22/h9,14-15H,5-8,10H2,1-4H3
49 atoms
O  0.683722 -1.421206 -0.584117
O  1.974932 -1.138373 1.228849
O  -2.408039 -3.108833 -1.623458
O  -1.312024 0.222757 1.270988
N  -1.550975 -1.658764 -0.042117
C  3.864325 0.469297 -0.607395
C  2.825114 1.466918 -0.205237
C  2.399324 0.118072 -0.769036
C  4.600183 0.725016 -1.90239
C  4.72139 -0.203996 0.435753
C  2.546209 1.846636 1.204344
C  1.707428 -0.859369 0.093657
C  3.341094 2.618241 1.945724
C  -0.245727 -2.208761 0.135087
C  2.968973 2.997017 3.346903
C  4.648609 3.171108 1.465084
C  -3.61668 -1.13576 -0.911264
C  -3.29991 -0.1627 -0.057336
C  -4.883745 -1.21709 -1.680876
C  -4.149549 1.014742 0.250066
C  -5.895642 -0.22249 -1.106674
C  -5.255573 1.132336 -0.800809
C  -2.497083 -2.115877 -0.956551
C  -1.952819 -0.444884 0.507629
H  2.667072 2.273974 -0.917919
H  2.020921 0.139429 -1.784261
H  3.96591 1.206768 -2.648068
H  5.461212 1.375234 -1.732238
H  4.970113 -0.207023 -2.333163
H  4.237133 -0.285235 1.403156
H  5.003399 -1.207198 0.111504
H  5.641714 0.368305 0.567846
H  1.610584 1.505002 1.634379
H  0.007655 -2.239966 1.19339
H  -0.246262 -3.218297 -0.273114
H  3.732338 2.667519 4.05635
H  2.891114 4.082308 3.454878
H  2.019024 2.558436 3.649521
H  4.873456 2.899352 0.435575
H  4.653293 4.262445 1.531628
H  5.472857 2.820835 2.091856
H  -4.680932 -1.000448 -2.734759
H  -5.276724 -2.235953 -1.660203
H  -4.57632 0.902471 1.252042
H  -3.541178 1.921094 0.288479
H  -6.725861 -0.096582 -1.803491
H  -6.323028 -0.634637 -0.187652
H  -6.014989 1.837986 -0.461218
H  -4.834096 1.548956 -1.720116
totalener: -1094.85080957 hartree
nucrepener: 2095.57045399 hartree
electener: -3190.42126356 hartree
oneelecener: -5653.34044553 hartree
twoeener: 2462.91918197 hartree
kineticenergy: 1090.09248402 hartree
xcener: -105.971594798236 hartree
chargesum: 0.0000000
charge: -0.279122 -0.369607 -0.320909 -0.325925 -0.112885 0.069013 -0.044092 -0.062972 -0.239790 -0.262261 -0.170208 0.333636 -0.025033 0.067254 -0.210859 -0.256592 -0.101718 -0.065748 -0.073083 -0.075444 -0.135613 -0.134402 0.269742 0.255538 0.097606 0.082633 0.072631 0.082301 0.092856 0.118132 0.093956 0.076776 0.102309 0.139007 0.113778 0.082047 0.081511 0.085224 0.078173 0.095451 0.092312 0.093344 0.093634 0.092354 0.094738 0.080351 0.074949 0.079670 0.075336
qa: -0.2791 -0.3696 -0.3209 -0.3259 -0.1129 0.0690 -0.0441 -0.0630 -0.2398 -0.2623 -0.1702 0.3336 -0.0250 0.0673 -0.2109 -0.2566 -0.1017 -0.0657 -0.0731 -0.0754 -0.1356 -0.1344 0.2697 0.2555 0.0976 0.0826 0.0726 0.0823 0.0929 0.1181 0.0940 0.0768 0.1023 0.1390 0.1138 0.0820 0.0815 0.0852 0.0782 0.0955 0.0923 0.0933 0.0936 0.0924 0.0947 0.0804 0.0749 0.0797 0.0753
va: 2.1029 2.1227 2.1947 2.1838 3.0870 3.7296 3.8824 3.8312 3.9029 3.9021 3.8921 4.1684 3.7401 3.8882 3.9381 3.9372 3.6568 3.6101 3.9238 3.9242 3.8966 3.8986 4.2779 4.2730 1.0044 1.0308 1.0078 1.0066 1.0049 1.0163 1.0059 0.9995 1.0236 1.0155 1.0128 0.9991 0.9976 1.0118 1.0086 1.0039 0.9976 1.0085 1.0192 1.0081 1.0196 1.0116 1.0086 1.0118 1.0089
dispcorr: -0.023895320 hartree
energy: -1094.874704889943
dipole: 15.90642 -16.94021 -1.03379 20.19695 -19.31216 0.88479 2.34360 -2.92731 -0.58371
magnitude: 1.48064 au
magnitude: 3.76349 debye
