program: Orca
programVersion: 5.0.2
elementType: O O O O N C C C C C C C C C C C C C C C C C C C H H H H H H H H H H H H H H H H H H H H H H H H H
charge: 0
multiplicity: 1
keywords: wb97x-d3
keywords: def2-TZVPP
keywords: def2/J RIJCOSX
keywords: DEFGRID2
keywords: scfconv7
keywords: smallprint printgap noloewdin
keywords: NOSOSCF
formula: C19H25NO4
InChI: InChI=1/C19H25NO4/c1-11(2)9-14-15(19(14,3)4)18(23)24-10-20-16(21)12-7-5-6-8-13(12)17(20)22/h9,14-15H,5-8,10H2,1-4H3
49 atoms
O  0.703901 -1.488129 -0.598791
O  1.970487 -1.20409 1.232272
O  -2.440025 -3.079011 -1.652372
O  -1.247016 0.198151 1.266361
N  -1.53893 -1.665228 -0.062426
C  3.873475 0.437592 -0.558916
C  2.796666 1.415046 -0.209765
C  2.425237 0.046042 -0.764166
C  4.643998 0.691149 -1.833938
C  4.712352 -0.195044 0.52388
C  2.456119 1.810363 1.181952
C  1.720762 -0.927773 0.092755
C  3.204062 2.612172 1.940135
C  -0.249748 -2.254838 0.110117
C  2.765445 3.008922 3.316638
C  4.517411 3.186192 1.50259
C  -3.592342 -1.078932 -0.921249
C  -3.24656 -0.122236 -0.060286
C  -4.86339 -1.118058 -1.68754
C  -4.061437 1.076241 0.258937
C  -5.844996 -0.098875 -1.103699
C  -5.165809 1.234348 -0.78826
C  -2.500052 -2.089378 -0.977411
C  -1.906825 -0.446123 0.498749
H  2.642851 2.206358 -0.940702
H  2.080521 0.041786 -1.791531
H  5.045255 -0.238519 -2.240934
H  4.023263 1.150308 -2.604876
H  5.486364 1.360813 -1.647181
H  5.027455 -1.197637 0.229781
H  5.614881 0.400852 0.673304
H  4.1990 -0.268493 1.476791
H  1.511506 1.455786 1.581114
H  0.000757 -2.306275 1.168416
H  -0.279304 -3.258612 -0.310582
H  2.667638 4.094433 3.400557
H  1.809109 2.562093 3.583994
H  3.500544 2.703817 4.065647
H  5.321964 2.870134 2.171556
H  4.792478 2.897896 0.489801
H  4.493136 4.278397 1.544317
H  -4.657519 -0.900479 -2.74058
H  -5.28577 -2.125204 -1.672239
H  -4.489126 0.967687 1.260963
H  -3.4273 1.964512 0.303718
H  -6.672144 0.05651 -1.797982
H  -6.282535 -0.505627 -0.187241
H  -5.904023 1.958653 -0.440964
H  -4.734594 1.646533 -1.705084
totalener: -1094.85064287 hartree
nucrepener: 2101.11085819 hartree
electener: -3195.96150106 hartree
oneelecener: -5664.43149894 hartree
twoeener: 2468.46999789 hartree
kineticenergy: 1090.09350512 hartree
xcener: -105.971800362951 hartree
chargesum: 0.0000000
charge: -0.278998 -0.366675 -0.320721 -0.328789 -0.112684 0.071998 -0.046224 -0.063783 -0.240036 -0.261605 -0.170705 0.329415 -0.025799 0.067629 -0.211351 -0.255649 -0.101925 -0.065965 -0.072890 -0.075648 -0.135786 -0.134440 0.270232 0.258308 0.096853 0.082900 0.092980 0.072463 0.082144 0.093966 0.076556 0.117418 0.105577 0.138648 0.113906 0.080925 0.085452 0.082225 0.092245 0.077692 0.095408 0.093414 0.093593 0.092287 0.094951 0.080363 0.075092 0.079624 0.075409
qa: -0.2790 -0.3667 -0.3207 -0.3288 -0.1127 0.0720 -0.0462 -0.0638 -0.2400 -0.2616 -0.1707 0.3294 -0.0258 0.0676 -0.2114 -0.2556 -0.1019 -0.0660 -0.0729 -0.0756 -0.1358 -0.1344 0.2702 0.2583 0.0969 0.0829 0.0930 0.0725 0.0821 0.0940 0.0766 0.1174 0.1056 0.1386 0.1139 0.0809 0.0855 0.0822 0.0922 0.0777 0.0954 0.0934 0.0936 0.0923 0.0950 0.0804 0.0751 0.0796 0.0754
va: 2.1016 2.1262 2.1950 2.1817 3.0873 3.7283 3.8826 3.8290 3.9027 3.9013 3.8916 4.1742 3.7412 3.8883 3.9383 3.9367 3.6571 3.6116 3.9235 3.9239 3.8965 3.8984 4.2771 4.2702 1.0043 1.0307 1.0048 1.0077 1.0067 1.0061 0.9994 1.0166 1.0202 1.0156 1.0131 0.9975 1.0119 0.9991 0.9976 1.0086 1.0038 1.0085 1.0192 1.0081 1.0195 1.0117 1.0086 1.0118 1.0089
dispcorr: -0.024038874 hartree
energy: -1094.874681739864
dipole: 15.50641 -16.54113 -1.03472 20.67187 -19.74638 0.92549 2.69467 -3.26528 -0.57061
magnitude: 1.50092 au
magnitude: 3.81504 debye
