program: Orca
programVersion: 5.0.2
elementType: O O O O N C C C C C C C C C C C C C C C C C C C H H H H H H H H H H H H H H H H H H H H H H H H H
charge: 0
multiplicity: 1
keywords: wb97x-d3
keywords: def2-TZVPP
keywords: def2/J RIJCOSX
keywords: DEFGRID2
keywords: scfconv7
keywords: smallprint printgap noloewdin
keywords: NOSOSCF
formula: C19H25NO4
InChI: InChI=1/C19H25NO4/c1-11(2)9-14-15(19(14,3)4)18(23)24-10-20-16(21)12-7-5-6-8-13(12)17(20)22/h9,14-15H,5-8,10H2,1-4H3
49 atoms
O  0.417193 -0.8397 0.021414
O  1.837916 -0.350761 -1.639363
O  -1.885646 0.852656 -1.468125
O  -2.350846 -3.087462 0.757768
N  -1.782784 -1.250819 -0.524353
C  2.536466 2.086228 0.208852
C  3.56589 1.046875 0.530131
C  2.0870 0.670861 0.523509
C  2.231238 3.106204 1.281312
C  2.414814 2.65236 -1.184724
C  4.533686 0.535437 -0.456793
C  1.480713 -0.2013 -0.501953
C  5.825277 0.279722 -0.229877
C  -0.431911 -1.565216 -0.850895
C  6.705198 -0.221609 -1.337512
C  6.531784 0.451515 1.081026
C  -3.719973 -0.057645 -0.176924
C  -3.852614 -1.208888 0.481078
C  -4.750315 1.007865 -0.251583
C  -5.046448 -1.609095 1.267476
C  -6.092568 0.454025 0.230441
C  -5.938906 -0.387314 1.497712
C  -2.379657 -0.028233 -0.821196
C  -2.609584 -2.008854 0.302022
H  3.950271 1.109305 1.542064
H  1.645879 0.5398 1.504581
H  2.332603 2.690715 2.284929
H  2.911451 3.956545 1.205338
H  1.212426 3.484897 1.180269
H  2.643163 1.94146 -1.972241
H  1.40056 3.016534 -1.35738
H  3.095409 3.498547 -1.292103
H  4.160828 0.356397 -1.456592
H  -0.282797 -2.634064 -0.701547
H  -0.229708 -1.311057 -1.890222
H  6.160432 -0.334999 -2.27367
H  7.541182 0.459886 -1.51553
H  7.142625 -1.191187 -1.085169
H  5.891545 0.798632 1.88868
H  6.982448 -0.491221 1.400893
H  7.351507 1.167896 0.98347
H  -4.436289 1.858157 0.362595
H  -4.824996 1.393123 -1.270946
H  -5.59058 -2.391552 0.728624
H  -4.743216 -2.060188 2.214915
H  -6.789616 1.274711 0.406176
H  -6.531407 -0.161426 -0.560335
H  -6.917976 -0.70778 1.856662
H  -5.50497 0.229706 2.289957
totalener: -1094.85280757 hartree
nucrepener: 2058.38894622 hartree
electener: -3153.24175379 hartree
oneelecener: -5578.77190697 hartree
twoeener: 2425.53015318 hartree
kineticenergy: 1090.08499081 hartree
xcener: -105.971498246478 hartree
chargesum: -0.0000000
charge: -0.275103 -0.391407 -0.319783 -0.319347 -0.113515 0.088906 0.034039 -0.088711 -0.242490 -0.256933 -0.208847 0.371318 -0.061583 0.071543 -0.204610 -0.242563 -0.071632 -0.097625 -0.076311 -0.075078 -0.134479 -0.134841 0.253047 0.265730 0.085331 0.080884 0.068591 0.088675 0.090273 0.098997 0.095554 0.086353 0.106640 0.114104 0.136457 0.081468 0.080919 0.081805 0.076445 0.086433 0.086293 0.092925 0.094150 0.092422 0.094884 0.079822 0.075657 0.079399 0.075794
qa: -0.2751 -0.3914 -0.3198 -0.3193 -0.1135 0.0889 0.0340 -0.0887 -0.2425 -0.2569 -0.2088 0.3713 -0.0616 0.0715 -0.2046 -0.2426 -0.0716 -0.0976 -0.0763 -0.0751 -0.1345 -0.1348 0.2530 0.2657 0.0853 0.0809 0.0686 0.0887 0.0903 0.0990 0.0956 0.0864 0.1066 0.1141 0.1365 0.0815 0.0809 0.0818 0.0764 0.0864 0.0863 0.0929 0.0941 0.0924 0.0949 0.0798 0.0757 0.0794 0.0758
va: 2.1069 2.0991 2.1913 2.1951 3.0908 3.7517 3.7851 3.8762 3.9101 3.9253 3.9036 4.1366 3.8204 3.8919 3.9378 3.9445 3.6121 3.6545 3.9282 3.9244 3.8973 3.8987 4.2836 4.2820 1.0087 1.0304 1.0085 1.0041 1.0047 1.0199 1.0030 1.0010 1.0287 1.0099 1.0124 1.0128 0.9976 0.9985 1.0172 0.9991 0.9990 1.0085 1.0188 1.0083 1.0190 1.0118 1.0087 1.0117 1.0086
dispcorr: -0.022112335 hartree
energy: -1094.874919902648
dipole: 17.44295 -18.62001 -1.17706 15.10382 -14.49431 0.60951 5.64722 -4.77555 0.87167
magnitude: 1.58644 au
magnitude: 4.03240 debye
