program: Orca
programVersion: 5.0.2
elementType: O O O O N C C C C C C C C C C C C C C C C C C C H H H H H H H H H H H H H H H H H H H H H H H H H
charge: 0
multiplicity: 1
keywords: wb97x-d3
keywords: def2-TZVPP
keywords: def2/J RIJCOSX
keywords: DEFGRID2
keywords: scfconv7
keywords: smallprint printgap noloewdin
keywords: NOSOSCF
formula: C19H25NO4
InChI: InChI=1/C19H25NO4/c1-11(2)9-14-15(19(14,3)4)18(23)24-10-20-16(21)12-7-5-6-8-13(12)17(20)22/h9,14-15H,5-8,10H2,1-4H3
49 atoms
O  0.38487 -0.777778 0.041636
O  1.848701 -0.383245 -1.606217
O  -2.013443 0.698743 -1.733401
O  -2.27887 -2.921961 1.009757
N  -1.802558 -1.249153 -0.512432
C  2.576008 2.089403 0.199351
C  3.581131 1.033656 0.544181
C  2.09485 0.689045 0.533035
C  2.288563 3.133785 1.253182
C  2.479738 2.633843 -1.204537
C  4.546464 0.491351 -0.428946
C  1.477079 -0.19139 -0.4796
C  5.837201 0.237231 -0.195351
C  -0.444357 -1.550644 -0.812906
C  6.715509 -0.295456 -1.289507
C  6.544827 0.441524 1.110288
C  -3.778208 -0.090179 -0.277572
C  -3.854941 -1.151091 0.525292
C  -4.839641 0.933195 -0.446631
C  -5.026852 -1.500494 1.366568
C  -5.874494 0.785999 0.670616
C  -6.237875 -0.678206 0.92035
C  -2.455618 -0.101263 -0.957521
C  -2.584794 -1.920625 0.425393
H  3.960004 1.103972 1.557688
H  1.64547 0.584255 1.513576
H  2.365338 2.729963 2.263716
H  2.995549 3.961697 1.17372
H  1.283167 3.542086 1.134832
H  1.480435 3.0323 -1.388193
H  3.19101 3.452615 -1.325434
H  2.684701 1.900204 -1.97769
H  4.17294 0.287552 -1.4236
H  -0.27209 -2.609444 -0.622899
H  -0.239918 -1.329149 -1.859067
H  7.157061 -1.254951 -1.008153
H  6.168365 -0.439785 -2.219887
H  7.548408 0.383005 -1.491374
H  6.990421 -0.494367 1.456098
H  7.368398 1.150357 0.992778
H  5.90671 0.814857 1.907819
H  -4.402847 1.934371 -0.451325
H  -5.307816 0.810916 -1.428747
H  -5.232532 -2.571462 1.305949
H  -4.78952 -1.304579 2.417301
H  -5.473488 1.220916 1.590719
H  -6.769688 1.358162 0.422609
H  -6.646547 -1.109754 0.002013
H  -7.026731 -0.745487 1.670906
totalener: -1094.85318475 hartree
nucrepener: 2054.07647202 hartree
electener: -3148.92965677 hartree
oneelecener: -5570.11283019 hartree
twoeener: 2421.18317341 hartree
kineticenergy: 1090.08527222 hartree
xcener: -105.971327829195 hartree
chargesum: 0.0000000
charge: -0.271814 -0.391770 -0.316678 -0.318340 -0.117720 0.087389 0.035871 -0.096583 -0.241737 -0.256457 -0.209193 0.370875 -0.061006 0.076786 -0.204553 -0.242411 -0.072901 -0.098854 -0.074674 -0.075826 -0.135119 -0.134146 0.249749 0.268743 0.085713 0.082038 0.069092 0.089215 0.089007 0.093770 0.087041 0.099903 0.107213 0.114297 0.135013 0.081592 0.081551 0.081082 0.086542 0.086140 0.076268 0.094101 0.092825 0.094488 0.093275 0.075217 0.080100 0.075027 0.079860
qa: -0.2718 -0.3918 -0.3167 -0.3183 -0.1177 0.0874 0.0359 -0.0966 -0.2417 -0.2565 -0.2092 0.3709 -0.0610 0.0768 -0.2046 -0.2424 -0.0729 -0.0989 -0.0747 -0.0758 -0.1351 -0.1341 0.2497 0.2687 0.0857 0.0820 0.0691 0.0892 0.0890 0.0938 0.0870 0.0999 0.1072 0.1143 0.1350 0.0816 0.0816 0.0811 0.0865 0.0861 0.0763 0.0941 0.0928 0.0945 0.0933 0.0752 0.0801 0.0750 0.0799
va: 2.1120 2.0991 2.1942 2.1956 3.0966 3.7516 3.7756 3.8824 3.9103 3.9249 3.9020 4.1401 3.8199 3.8935 3.9380 3.9447 3.6123 3.6479 3.9255 3.9261 3.8994 3.8962 4.2850 4.2787 1.0090 1.0301 1.0085 1.0039 1.0050 1.0026 1.0010 1.0196 1.0288 1.0064 1.0138 0.9986 1.0129 0.9976 0.9991 0.9990 1.0172 1.0191 1.0082 1.0191 1.0085 1.0088 1.0118 1.0087 1.0118
dispcorr: -0.021986846 hartree
energy: -1094.875171600555
dipole: 17.74919 -18.91819 -1.16900 14.99419 -14.37729 0.61690 5.48142 -4.62169 0.85972
magnitude: 1.57678 au
magnitude: 4.00787 debye
