program: Orca
programVersion: 5.0.2
elementType: O O O O N C C C C C C C C C C C C C C C C C C C H H H H H H H H H H H H H H H H H H H H H H H H H
charge: 0
multiplicity: 1
keywords: wb97x-d3
keywords: def2-TZVPP
keywords: def2/J RIJCOSX
keywords: DEFGRID2
keywords: scfconv7
keywords: smallprint printgap noloewdin
keywords: NOSOSCF
formula: C19H25NO4
InChI: InChI=1/C19H25NO4/c1-11(2)9-14-15(19(14,3)4)18(23)24-10-20-16(21)12-7-5-6-8-13(12)17(20)22/h9,14-15H,5-8,10H2,1-4H3
49 atoms
O  -0.554617 1.729681 1.403004
O  -0.511923 1.710711 -0.832022
O  2.49682 2.400342 -0.914719
O  1.407175 -0.373976 2.519311
N  1.735928 1.300513 0.971443
C  -3.570979 1.165114 -0.656165
C  -2.909924 -0.174369 -0.589473
C  -2.456107 0.945398 0.347644
C  -3.359548 2.005297 -1.892195
C  -4.945569 1.357661 -0.059626
C  -3.554272 -1.364517 -0.006219
C  -1.103488 1.49767 0.200126
C  -3.390845 -2.634414 -0.394215
C  0.771368 2.235493 1.46032
C  -4.123696 -3.74345 0.299334
C  -2.50576 -3.086822 -1.514839
C  3.178491 0.139728 -0.399128
C  2.855809 -0.679726 0.602279
C  4.114559 -0.186645 -1.501443
C  3.350724 -2.068135 0.762938
C  4.901056 -1.448372 -1.142473
C  4.001527 -2.528463 -0.542632
C  2.458181 1.422362 -0.211805
C  1.92371 0.032905 1.507995
H  -2.219011 -0.360651 -1.404432
H  -2.784626 0.845036 1.3757
H  -4.192975 1.843508 -2.578305
H  -3.339463 3.069014 -1.648313
H  -2.446724 1.762957 -2.430105
H  -5.076336 0.846114 0.89267
H  -5.133591 2.418802 0.112689
H  -5.713579 0.993191 -0.744412
H  -4.223766 -1.180575 0.828735
H  0.943877 2.439769 2.513737
H  0.871632 3.1666 0.903789
H  -4.775392 -3.37599 1.091733
H  -4.736369 -4.309828 -0.406822
H  -3.42442 -4.458074 0.741314
H  -1.922458 -2.28901 -1.969589
H  -1.806504 -3.849383 -1.163279
H  -3.098518 -3.556117 -2.304284
H  3.546936 -0.332587 -2.425784
H  4.787059 0.653294 -1.689845
H  4.068942 -2.103187 1.588082
H  2.531285 -2.732078 1.04745
H  5.403911 -1.830239 -2.031514
H  5.684511 -1.190596 -0.424528
H  4.576414 -3.43736 -0.362299
H  3.219979 -2.788449 -1.261779
elementType: O N C H
totalener: -1094.86913260 hartree
nucrepener: 2124.23448035 hartree
electener: -3219.10361295 hartree
oneelecener: -5711.22731407 hartree
twoeener: 2492.12370113 hartree
cpcmener: -0.04069519 hartree
kineticenergy: 1090.04607036 hartree
xcener: -105.976192312964 hartree
chargesum: 0.0000000
charge: -0.289398 -0.493092 -0.430460 -0.436046 -0.105736 0.116774 0.024896 -0.107207 -0.279645 -0.279801 -0.275379 0.434820 -0.050167 0.088217 -0.218211 -0.253280 -0.057978 -0.078836 -0.072531 -0.073282 -0.135775 -0.136959 0.332540 0.331883 0.105783 0.090046 0.095473 0.099839 0.091445 0.092204 0.097613 0.098497 0.120800 0.145544 0.134512 0.088908 0.093189 0.094277 0.090764 0.094526 0.098925 0.102269 0.094057 0.101752 0.093929 0.081643 0.078187 0.081127 0.079345
qa: -0.2894 -0.4931 -0.4305 -0.4360 -0.1057 0.1168 0.0249 -0.1072 -0.2796 -0.2798 -0.2754 0.4348 -0.0502 0.0882 -0.2182 -0.2533 -0.0580 -0.0788 -0.0725 -0.0733 -0.1358 -0.1370 0.3325 0.3319 0.1058 0.0900 0.0955 0.0998 0.0914 0.0922 0.0976 0.0985 0.1208 0.1455 0.1345 0.0889 0.0932 0.0943 0.0908 0.0945 0.0989 0.1023 0.0941 0.1018 0.0939 0.0816 0.0782 0.0811 0.0793
va: 2.1107 2.0144 2.0789 2.0740 3.0869 3.6752 3.7997 3.8216 3.8957 3.9151 3.8841 4.1246 3.7622 3.8872 3.9186 3.9379 3.6591 3.7066 3.9140 3.9175 3.9153 3.9163 4.1861 4.1876 1.0201 1.0364 0.9995 0.9998 1.0203 1.0065 1.0011 1.0007 1.0108 0.9927 1.0149 1.0087 0.9957 0.9965 1.0115 0.9971 0.9962 1.0047 1.0157 1.0047 1.0151 1.0092 1.0065 1.0093 1.0066
dispcorr: -0.022869407 hartree
energy: -1094.892002009005
dipole: -17.86606 18.08448 0.21842 -18.46969 16.97448 -1.49521 -10.40176 10.41932 0.01756
magnitude: 1.51118 au
magnitude: 3.84111 debye
