program: Orca
programVersion: 5.0.2
elementType: O O O O N C C C C C C C C C C C C C C C C C C C H H H H H H H H H H H H H H H H H H H H H H H H H
charge: 0
multiplicity: 1
keywords: wb97x-d3
keywords: def2-TZVPP
keywords: def2/J RIJCOSX
keywords: DEFGRID2
keywords: scfconv7
keywords: smallprint printgap noloewdin
keywords: NOSOSCF
formula: C19H25NO4
InChI: InChI=1/C19H25NO4/c1-11(2)9-14-15(19(14,3)4)18(23)24-10-20-16(21)12-7-5-6-8-13(12)17(20)22/h9,14-15H,5-8,10H2,1-4H3
49 atoms
O  -0.561474 1.753733 1.406367
O  -0.516068 1.748357 -0.828524
O  2.501204 2.408833 -0.904217
O  1.370158 -0.376549 2.50725
N  1.723441 1.305086 0.97262
C  -3.566208 1.173792 -0.67239
C  -2.895578 -0.159945 -0.591853
C  -2.459606 0.970281 0.343224
C  -3.353388 2.008708 -1.911827
C  -4.947149 1.358837 -0.087753
C  -3.541843 -1.352778 -0.016869
C  -1.108149 1.526495 0.201556
C  -3.3124 -2.625653 -0.358649
C  0.768749 2.247833 1.46634
C  -4.072579 -3.739903 0.295501
C  -2.329656 -3.072296 -1.398087
C  3.145952 0.132736 -0.409173
C  2.811603 -0.6895 0.58609
C  4.077198 -0.199177 -1.513952
C  3.286875 -2.085836 0.736829
C  4.847172 -1.473141 -1.162638
C  3.933059 -2.545607 -0.57122
C  2.446548 1.425198 -0.210336
C  1.891779 0.030279 1.498538
H  -2.194188 -0.345339 -1.398193
H  -2.795595 0.873867 1.369192
H  -4.18131 1.836029 -2.601993
H  -3.343993 3.073851 -1.673816
H  -2.435332 1.771082 -2.442719
H  -5.080386 0.856229 0.868977
H  -5.145511 2.419949 0.072873
H  -5.707061 0.98091 -0.774267
H  -4.277717 -1.169098 0.760055
H  0.943228 2.445503 2.520695
H  0.878139 3.180421 0.914074
H  -4.806722 -3.373684 1.012871
H  -4.599991 -4.342904 -0.448192
H  -3.396958 -4.420866 0.819407
H  -2.848438 -3.446929 -2.283687
H  -1.644807 -2.291933 -1.721865
H  -1.729405 -3.902273 -1.020676
H  3.507301 -0.33267 -2.43878
H  4.760471 0.63297 -1.697968
H  4.003273 -2.136854 1.562695
H  2.457856 -2.740466 1.015269
H  5.346144 -1.855437 -2.053672
H  5.633023 -1.230368 -0.442112
H  4.496043 -3.462951 -0.396368
H  3.149233 -2.790668 -1.293123
elementType: O N C H
totalener: -1094.86884831 hartree
nucrepener: 2129.26508214 hartree
electener: -3224.13393046 hartree
oneelecener: -5721.27270994 hartree
twoeener: 2497.13877948 hartree
cpcmener: -0.04064327 hartree
kineticenergy: 1090.05036423 hartree
xcener: -105.977011437319 hartree
chargesum: 0.0000000
charge: -0.289567 -0.493310 -0.430345 -0.435983 -0.106361 0.120740 0.019418 -0.105054 -0.280339 -0.284060 -0.278371 0.433350 -0.038531 0.088882 -0.219803 -0.260017 -0.056792 -0.079231 -0.072555 -0.073467 -0.135818 -0.136697 0.332117 0.331776 0.105294 0.091086 0.095500 0.099679 0.091534 0.092980 0.097738 0.099335 0.120392 0.145511 0.134243 0.088160 0.093443 0.094717 0.101827 0.092418 0.094039 0.102218 0.093970 0.101711 0.094027 0.081558 0.078244 0.081211 0.079183
qa: -0.2896 -0.4933 -0.4303 -0.4360 -0.1064 0.1207 0.0194 -0.1051 -0.2803 -0.2841 -0.2784 0.4334 -0.0385 0.0889 -0.2198 -0.2600 -0.0568 -0.0792 -0.0726 -0.0735 -0.1358 -0.1367 0.3321 0.3318 0.1053 0.0911 0.0955 0.0997 0.0915 0.0930 0.0977 0.0993 0.1204 0.1455 0.1342 0.0882 0.0934 0.0947 0.1018 0.0924 0.0940 0.1022 0.0940 0.1017 0.0940 0.0816 0.0782 0.0812 0.0792
va: 2.1104 2.0142 2.0791 2.0741 3.0869 3.6802 3.8096 3.8185 3.8944 3.9163 3.8958 4.1274 3.7470 3.8869 3.9215 3.9386 3.6582 3.7058 3.9136 3.9179 3.9154 3.9163 4.1857 4.1878 1.0187 1.0357 0.9995 0.9998 1.0205 1.0064 1.0010 1.0003 1.0105 0.9927 1.0151 1.0088 0.9948 0.9966 0.9953 1.0100 0.9975 1.0047 1.0158 1.0047 1.0150 1.0092 1.0065 1.0093 1.0067
dispcorr: -0.022988028 hartree
energy: -1094.891836340549
dipole: -17.58025 17.78722 0.20698 -18.60083 17.07184 -1.52899 -10.38773 10.38689 -0.00083
magnitude: 1.54294 au
magnitude: 3.92183 debye
