program: Orca
programVersion: 5.0.2
elementType: O O O O N C C C C C C C C C C C C C C C C C C C H H H H H H H H H H H H H H H H H H H H H H H H H
charge: 0
multiplicity: 1
keywords: wb97x-d3
keywords: def2-TZVPP
keywords: def2/J RIJCOSX
keywords: DEFGRID2
keywords: scfconv7
keywords: smallprint printgap noloewdin
keywords: NOSOSCF
formula: C19H25NO4
InChI: InChI=1/C19H25NO4/c1-11(2)9-14-15(19(14,3)4)18(23)24-10-20-16(21)12-7-5-6-8-13(12)17(20)22/h9,14-15H,5-8,10H2,1-4H3
49 atoms
O  -0.501744 1.629125 1.23048
O  -0.615714 1.430572 -0.994415
O  2.366333 2.146717 -1.330191
O  1.754812 -0.08252 2.585849
N  1.797109 1.304104 0.746435
C  -3.68208 1.123746 -0.442427
C  -3.101706 -0.247013 -0.590027
C  -2.458217 0.738645 0.374711
C  -3.567122 2.073755 -1.608681
C  -4.952308 1.326451 0.348647
C  -3.756759 -1.449358 -0.041974
C  -1.123676 1.28512 0.092249
C  -3.859875 -2.644806 -0.631918
C  0.78425 2.226481 1.150934
C  -4.57129 -3.773493 0.052657
C  -3.307785 -2.990351 -1.980565
C  3.343364 0.108877 -0.47333
C  3.165776 -0.548529 0.672688
C  4.271801 -0.295991 -1.556063
C  3.847001 -1.811348 1.045461
C  5.221326 -1.376966 -1.036812
C  4.490404 -2.424891 -0.198801
C  2.468638 1.307105 -0.472363
C  2.175572 0.19268 1.489492
H  -2.542417 -0.387236 -1.508603
H  -2.655637 0.56537 1.426494
H  -2.729538 1.852244 -2.264742
H  -4.475247 2.010487 -2.210256
H  -3.471078 3.106527 -1.269287
H  -5.002643 0.709038 1.244028
H  -5.036223 2.367463 0.664882
H  -5.825334 1.097263 -0.265245
H  -4.200474 -1.337937 0.94283
H  0.985431 2.584237 2.156703
H  0.791092 3.077345 0.471468
H  -5.403905 -4.136905 -0.555092
H  -3.902935 -4.625694 0.199774
H  -4.966468 -3.48277 1.025602
H  -2.593616 -3.813733 -1.900597
H  -4.104618 -3.340303 -2.641389
H  -2.805185 -2.164369 -2.47924
H  3.692278 -0.664395 -2.407718
H  4.828649 0.568891 -1.922911
H  4.601375 -1.604234 1.80975
H  3.137001 -2.504147 1.50116
H  5.724241 -1.854078 -1.878358
H  6.000602 -0.909864 -0.429229
H  5.180715 -3.214627 0.098754
H  3.714354 -2.896818 -0.807151
elementType: O N C H
totalener: -1094.87015981 hartree
nucrepener: 2095.81556727 hartree
electener: -3190.68572708 hartree
oneelecener: -5654.40872994 hartree
twoeener: 2463.72300286 hartree
cpcmener: -0.04101958 hartree
kineticenergy: 1090.05652879 hartree
xcener: -105.978221201834 hartree
chargesum: 0.0000000
charge: -0.288127 -0.492052 -0.430167 -0.435691 -0.102205 0.103252 0.042792 -0.115246 -0.276988 -0.273338 -0.281117 0.442453 -0.050760 0.083119 -0.218128 -0.252300 -0.068807 -0.080577 -0.073216 -0.074076 -0.136282 -0.134446 0.340790 0.336870 0.097275 0.088764 0.091841 0.096396 0.100097 0.090312 0.098313 0.098040 0.121237 0.147219 0.134379 0.093824 0.093870 0.088799 0.097153 0.096339 0.089486 0.102819 0.094415 0.101740 0.093293 0.080840 0.078404 0.080701 0.078691
qa: -0.2881 -0.4921 -0.4302 -0.4357 -0.1022 0.1033 0.0428 -0.1152 -0.2770 -0.2733 -0.2811 0.4425 -0.0508 0.0831 -0.2181 -0.2523 -0.0688 -0.0806 -0.0732 -0.0741 -0.1363 -0.1344 0.3408 0.3369 0.0973 0.0888 0.0918 0.0964 0.1001 0.0903 0.0983 0.0980 0.1212 0.1472 0.1344 0.0938 0.0939 0.0888 0.0972 0.0963 0.0895 0.1028 0.0944 0.1017 0.0933 0.0808 0.0784 0.0807 0.0787
va: 2.1117 2.0161 2.0788 2.0747 3.0880 3.6839 3.7763 3.8310 3.9023 3.9143 3.8779 4.1249 3.7626 3.8861 3.9184 3.9399 3.6664 3.7031 3.9181 3.9204 3.9170 3.9154 4.1878 4.1897 1.0272 1.0370 1.0197 0.9998 0.9994 1.0068 1.0012 1.0015 1.0106 0.9945 1.0156 0.9961 0.9962 1.0089 0.9964 0.9971 1.0109 1.0046 1.0155 1.0045 1.0156 1.0092 1.0066 1.0094 1.0068
dispcorr: -0.022457448 hartree
energy: -1094.892617253119
dipole: -19.46179 19.78304 0.32125 -17.37569 16.10768 -1.26801 -8.69690 8.90430 0.20740
magnitude: 1.32441 au
magnitude: 3.36638 debye
