program: Orca
programVersion: 5.0.2
elementType: O O O O N C C C C C C C C C C C C C C C C C C C H H H H H H H H H H H H H H H H H H H H H H H H H
charge: 0
multiplicity: 1
keywords: wb97x-d3
keywords: def2-TZVPP
keywords: def2/J RIJCOSX
keywords: DEFGRID2
keywords: scfconv7
keywords: smallprint printgap noloewdin
keywords: NOSOSCF
formula: C19H25NO4
InChI: InChI=1/C19H25NO4/c1-11(2)9-14-15(19(14,3)4)18(23)24-10-20-16(21)12-7-5-6-8-13(12)17(20)22/h9,14-15H,5-8,10H2,1-4H3
49 atoms
O  -0.427269 1.81003 1.097821
O  -0.568721 1.330367 -1.082764
O  1.80779 0.184823 2.482284
O  2.403602 2.201556 -1.549044
N  1.860525 1.482443 0.579421
C  -3.594015 0.848413 -0.430448
C  -2.898332 -0.473652 -0.3571
C  -2.336736 0.703356 0.412856
C  -3.57673 1.607135 -1.733962
C  -4.871542 1.039738 0.348504
C  -3.452157 -1.619785 0.405579
C  -1.047573 1.294003 0.026051
C  -4.078588 -2.669217 -0.132766
C  0.841816 2.422231 0.927848
C  -4.594201 -3.786542 0.722048
C  -4.325432 -2.825798 -1.601083
C  3.20696 -0.38764 0.588514
C  3.376118 0.205465 -0.593573
C  3.90153 -1.621101 1.03076
C  4.278465 -0.272458 -1.668066
C  5.07935 -1.904445 0.096748
C  4.704311 -1.711002 -1.371695
C  2.228589 0.403596 1.373144
C  2.514275 1.411146 -0.646225
H  -2.339843 -0.728891 -1.253267
H  -2.513088 0.687731 1.482687
H  -4.485977 1.378466 -2.292397
H  -3.560014 2.685257 -1.565979
H  -2.734327 1.35091 -2.371629
H  -5.058916 2.099887 0.522774
H  -5.719352 0.641517 -0.21086
H  -4.852431 0.543391 1.317354
H  -3.337096 -1.587852 1.485209
H  1.06122 2.875508 1.890925
H  0.814395 3.206057 0.171766
H  -4.382184 -3.62747 1.779061
H  -5.675085 -3.90024 0.60675
H  -4.150731 -4.741447 0.42854
H  -3.865269 -3.742826 -1.977371
H  -5.396449 -2.917106 -1.798358
H  -3.950186 -1.993422 -2.194022
H  4.238853 -1.519713 2.064605
H  3.191742 -2.454187 1.024366
H  3.78494 -0.202672 -2.639975
H  5.150441 0.386791 -1.724497
H  5.9066 -1.235882 0.349475
H  5.437292 -2.921287 0.259956
H  3.885036 -2.388087 -1.628316
H  5.545544 -1.980795 -2.010892
elementType: O N C H
totalener: -1094.86851884 hartree
nucrepener: 2098.68123647 hartree
electener: -3193.54975532 hartree
oneelecener: -5660.16496534 hartree
twoeener: 2466.61521002 hartree
cpcmener: -0.03995847 hartree
kineticenergy: 1090.05883362 hartree
xcener: -105.977244354877 hartree
chargesum: -0.0000000
charge: -0.287380 -0.490640 -0.435930 -0.430235 -0.103924 0.156925 -0.008997 -0.142761 -0.299688 -0.268630 -0.264980 0.441727 -0.036916 0.087810 -0.229053 -0.250385 -0.077265 -0.063545 -0.071842 -0.077529 -0.137081 -0.133124 0.335913 0.334153 0.103132 0.090903 0.095864 0.103007 0.093036 0.099372 0.096676 0.092277 0.124480 0.147009 0.133423 0.089938 0.094611 0.095343 0.098970 0.096739 0.088525 0.093268 0.102509 0.093776 0.102420 0.078300 0.081051 0.078253 0.080496
qa: -0.2874 -0.4906 -0.4359 -0.4302 -0.1039 0.1569 -0.0090 -0.1428 -0.2997 -0.2686 -0.2650 0.4417 -0.0369 0.0878 -0.2291 -0.2504 -0.0773 -0.0635 -0.0718 -0.0775 -0.1371 -0.1331 0.3359 0.3342 0.1031 0.0909 0.0959 0.1030 0.0930 0.0994 0.0967 0.0923 0.1245 0.1470 0.1334 0.0899 0.0946 0.0953 0.0990 0.0967 0.0885 0.0933 0.1025 0.0938 0.1024 0.0783 0.0811 0.0783 0.0805
va: 2.1126 2.0179 2.0737 2.0791 3.0865 3.6523 3.7909 3.9028 3.8990 3.9097 3.8692 4.1269 3.7031 3.8843 3.9257 3.9417 3.7046 3.6670 3.9159 3.9166 3.9184 3.9159 4.1885 4.1844 1.0207 1.0393 1.0005 0.9991 1.0192 1.0028 1.0025 1.0020 1.0063 0.9923 1.0158 1.0076 0.9960 0.9953 0.9981 0.9973 1.0080 1.0156 1.0044 1.0154 1.0040 1.0065 1.0093 1.0066 1.0094
dispcorr: -0.023109858 hartree
energy: -1094.891628700852
dipole: -21.42101 21.63880 0.21779 -18.81292 17.54174 -1.27117 -6.59616 6.86173 0.26558
magnitude: 1.31675 au
magnitude: 3.34692 debye
