program: Orca
programVersion: 5.0.2
elementType: O O O O N C C C C C C C C C C C C C C C C C C C H H H H H H H H H H H H H H H H H H H H H H H H H
charge: 0
multiplicity: 1
keywords: wb97x-d3
keywords: def2-TZVPP
keywords: def2/J RIJCOSX
keywords: DEFGRID2
keywords: scfconv7
keywords: smallprint printgap noloewdin
keywords: NOSOSCF
formula: C19H25NO4
InChI: InChI=1/C19H25NO4/c1-11(2)9-14-15(19(14,3)4)18(23)24-10-20-16(21)12-7-5-6-8-13(12)17(20)22/h9,14-15H,5-8,10H2,1-4H3
49 atoms
O  -0.428137 1.711928 1.32318
O  -0.466038 1.51936 -0.904797
O  2.50142 2.351632 -1.151346
O  1.729912 -0.094555 2.60479
N  1.87643 1.413963 0.868462
C  -3.50288 0.900649 -0.488545
C  -2.779052 -0.406534 -0.511173
C  -2.293192 0.691728 0.411753
C  -3.43528 1.788902 -1.7062
C  -4.829322 0.977842 0.227094
C  -3.353973 -1.641243 0.081594
C  -0.99578 1.337275 0.166097
C  -4.079707 -2.534333 -0.596012
C  0.854283 2.321815 1.286474
C  -4.615611 -3.767449 0.064092
C  -4.42095 -2.387065 -2.046819
C  3.376844 0.224101 -0.412783
C  3.14977 -0.499203 0.684385
C  4.287869 -0.162305 -1.516747
C  3.770581 -1.811702 0.984772
C  4.626076 -1.649315 -1.397055
C  4.952111 -2.046905 0.041918
C  2.561302 1.460694 -0.342266
C  2.182829 0.234054 1.536054
H  -2.159523 -0.55291 -1.39279
H  -2.530566 0.558906 1.461859
H  -2.544469 1.626799 -2.308338
H  -4.298501 1.585127 -2.343052
H  -3.473884 2.844828 -1.431961
H  -5.629546 0.603457 -0.415472
H  -4.844594 0.396402 1.148635
H  -5.06706 2.012086 0.482845
H  -3.166107 -1.816403 1.137019
H  1.034696 2.648879 2.306937
H  0.869796 3.193601 0.633285
H  -5.705021 -3.80942 -0.011993
H  -4.237756 -4.669215 -0.424609
H  -4.347863 -3.818598 1.119261
H  -4.021082 -3.223125 -2.626616
H  -5.504519 -2.407173 -2.187936
H  -4.045907 -1.463924 -2.486389
H  3.831603 0.059622 -2.484179
H  5.19601 0.446787 -1.463008
H  4.089044 -1.854485 2.028813
H  3.017357 -2.597213 0.866654
H  3.776972 -2.239503 -1.753035
H  5.467525 -1.885044 -2.049494
H  5.810741 -1.4664 0.390729
H  5.245847 -3.09636 0.081789
elementType: O N C H
totalener: -1094.86814060 hartree
nucrepener: 2104.98022058 hartree
electener: -3199.84836118 hartree
oneelecener: -5672.74766909 hartree
twoeener: 2472.89930791 hartree
cpcmener: -0.03961285 hartree
kineticenergy: 1090.03708704 hartree
xcener: -105.972778783913 hartree
chargesum: 0.0000000
charge: -0.288584 -0.491048 -0.429615 -0.435818 -0.107406 0.131236 -0.012634 -0.125070 -0.300726 -0.275372 -0.250890 0.439815 -0.044719 0.087972 -0.229482 -0.247809 -0.064714 -0.073296 -0.077118 -0.070650 -0.133541 -0.138140 0.334838 0.334572 0.107115 0.092554 0.094187 0.096279 0.104290 0.097515 0.093856 0.100940 0.124101 0.146383 0.133991 0.094396 0.095486 0.090069 0.102735 0.096758 0.086875 0.093117 0.102214 0.093306 0.102659 0.079207 0.080571 0.078732 0.080864
qa: -0.2886 -0.4910 -0.4296 -0.4358 -0.1074 0.1312 -0.0126 -0.1251 -0.3007 -0.2754 -0.2509 0.4398 -0.0447 0.0880 -0.2295 -0.2478 -0.0647 -0.0733 -0.0771 -0.0706 -0.1335 -0.1381 0.3348 0.3346 0.1071 0.0926 0.0942 0.0963 0.1043 0.0975 0.0939 0.1009 0.1241 0.1464 0.1340 0.0944 0.0955 0.0901 0.1027 0.0968 0.0869 0.0931 0.1022 0.0933 0.1027 0.0792 0.0806 0.0787 0.0809
va: 2.1126 2.0160 2.0795 2.0739 3.0879 3.6665 3.8059 3.8730 3.8933 3.9103 3.8538 4.1333 3.7104 3.8869 3.9272 3.9364 3.6632 3.7016 3.9171 3.9148 3.9159 3.9191 4.1824 4.1876 1.0194 1.0370 1.0195 1.0000 0.9995 1.0005 1.0019 1.0027 1.0056 0.9928 1.0152 0.9963 0.9953 1.0072 0.9988 0.9979 1.0081 1.0160 1.0037 1.0156 1.0043 1.0063 1.0094 1.0061 1.0092
dispcorr: -0.023477162 hartree
energy: -1094.891617765568
dipole: -21.85924 21.96756 0.10832 -18.00750 16.61827 -1.38923 -10.10226 10.17580 0.07354
magnitude: 1.39539 au
magnitude: 3.54680 debye
