program: Orca
programVersion: 5.0.2
elementType: O O O O N C C C C C C C C C C C C C C C C C C C H H H H H H H H H H H H H H H H H H H H H H H H H
charge: 0
multiplicity: 1
keywords: wb97x-d3
keywords: def2-TZVPP
keywords: def2/J RIJCOSX
keywords: DEFGRID2
keywords: scfconv7
keywords: smallprint printgap noloewdin
keywords: NOSOSCF
formula: C19H25NO4
InChI: InChI=1/C19H25NO4/c1-11(2)9-14-15(19(14,3)4)18(23)24-10-20-16(21)12-7-5-6-8-13(12)17(20)22/h9,14-15H,5-8,10H2,1-4H3
49 atoms
O  -0.329851 1.333986 -0.056605
O  -1.434368 0.862686 1.840352
O  2.86886 2.701757 -1.220552
O  1.575149 -0.563559 1.658193
N  1.951314 1.316115 0.381407
C  -2.498007 -1.503196 0.060557
C  -3.560018 -0.460832 0.233306
C  -2.180086 -0.04552 -0.241217
C  -1.933523 -2.169988 1.290995
C  -2.536587 -2.423993 -1.135005
C  -4.701087 -0.321846 -0.69118
C  -1.311439 0.742198 0.644963
C  -5.968545 -0.05279 -0.36017
C  0.721522 1.993639 0.636172
C  -7.023887 0.06608 -1.418535
C  -6.469507 0.145795 1.03772
C  3.919986 0.614252 -0.586409
C  3.539757 -0.347161 0.25663
C  5.162243 0.59703 -1.396186
C  4.279622 -1.607702 0.503554
C  6.091237 -0.502856 -0.878899
C  5.334206 -1.797642 -0.58824
C  2.89813 1.689394 -0.566784
C  2.25694 0.056157 0.878966
H  -3.759897 -0.209442 1.269149
H  -2.078701 0.185186 -1.295769
H  -2.031164 -1.568489 2.191635
H  -2.464115 -3.107034 1.469752
H  -0.877511 -2.412718 1.156304
H  -1.549549 -2.854426 -1.312836
H  -3.228826 -3.249156 -0.9567
H  -2.844134 -1.922505 -2.051316
H  -4.475014 -0.444064 -1.746403
H  0.532391 2.034275 1.706098
H  0.795601 3.008858 0.254108
H  -7.483495 1.057712 -1.402332
H  -6.625888 -0.104659 -2.418609
H  -7.832227 -0.650106 -1.2496
H  -7.005492 1.094269 1.120872
H  -7.187603 -0.635666 1.29956
H  -5.687666 0.140031 1.794223
H  4.906099 0.426961 -2.446609
H  5.652734 1.572314 -1.358976
H  4.747452 -1.563885 1.492061
H  3.589355 -2.453818 0.533505
H  6.881557 -0.685165 -1.607711
H  6.580623 -0.157971 0.036085
H  6.031534 -2.581042 -0.289716
H  4.844934 -2.143407 -1.50292
elementType: O N C H
totalener: -1094.87008682 hartree
nucrepener: 2068.92625046 hartree
electener: -3163.79633728 hartree
oneelecener: -5600.33087834 hartree
twoeener: 2436.53454107 hartree
cpcmener: -0.03888858 hartree
kineticenergy: 1090.04406839 hartree
xcener: -105.975690020081 hartree
chargesum: -0.0000000
charge: -0.286054 -0.480362 -0.434345 -0.440326 -0.097275 0.106597 0.031207 -0.087827 -0.279756 -0.273301 -0.282203 0.408160 -0.052047 0.080492 -0.217071 -0.253437 -0.078465 -0.057471 -0.072476 -0.070768 -0.135696 -0.135703 0.345384 0.337122 0.097038 0.092631 0.093752 0.099898 0.093661 0.098208 0.098224 0.090612 0.121593 0.142401 0.126079 0.093935 0.088623 0.093013 0.094718 0.098821 0.090499 0.102569 0.094151 0.101384 0.093586 0.081288 0.078895 0.081024 0.079017
qa: -0.2861 -0.4804 -0.4343 -0.4403 -0.0973 0.1066 0.0312 -0.0878 -0.2798 -0.2733 -0.2822 0.4082 -0.0520 0.0805 -0.2171 -0.2534 -0.0785 -0.0575 -0.0725 -0.0708 -0.1357 -0.1357 0.3454 0.3371 0.0970 0.0926 0.0938 0.0999 0.0937 0.0982 0.0982 0.0906 0.1216 0.1424 0.1261 0.0939 0.0886 0.0930 0.0947 0.0988 0.0905 0.1026 0.0942 0.1014 0.0936 0.0813 0.0789 0.0810 0.0790
va: 2.1091 2.0242 2.0779 2.0669 3.1042 3.6821 3.7887 3.8078 3.8975 3.9111 3.8737 4.1620 3.7657 3.8616 3.9192 3.9393 3.7116 3.6745 3.9173 3.9167 3.9147 3.9154 4.1953 4.1861 1.0273 1.0347 1.0168 1.0018 1.0066 1.0014 1.0013 1.0064 1.0106 1.0156 1.0154 0.9965 1.0090 0.9958 0.9970 0.9964 1.0108 1.0048 1.0151 1.0046 1.0155 1.0094 1.0066 1.0093 1.0067
dispcorr: -0.022568503 hartree
energy: -1094.892655322936
dipole: -19.36621 20.60489 1.23868 -16.54337 15.40485 -1.13851 -5.49620 4.27970 -1.21651
magnitude: 2.07616 au
magnitude: 5.27717 debye
