program: Orca
programVersion: 5.0.2
elementType: O O O O N C C C C C C C C C C C C C C C C C C C H H H H H H H H H H H H H H H H H H H H H H H H H
charge: 0
multiplicity: 1
keywords: wb97x-d3
keywords: def2-TZVPP
keywords: def2/J RIJCOSX
keywords: DEFGRID2
keywords: scfconv7
keywords: smallprint printgap noloewdin
keywords: NOSOSCF
formula: C19H25NO4
InChI: InChI=1/C19H25NO4/c1-11(2)9-14-15(19(14,3)4)18(23)24-10-20-16(21)12-7-5-6-8-13(12)17(20)22/h9,14-15H,5-8,10H2,1-4H3
49 atoms
O  -0.178538 -0.996754 1.088582
O  -1.108003 -2.096032 -0.63621
O  1.699309 -0.945684 -1.617193
O  2.918173 -0.35777 2.717864
N  2.110152 -0.997018 0.652036
C  -2.556521 0.66252 -0.996913
C  -3.508457 -0.3295 -0.401442
C  -2.146992 -0.128126 0.23764
C  -1.942118 0.352894 -2.340653
C  -2.77422 2.140456 -0.781964
C  -4.709824 0.074085 0.354903
C  -1.126361 -1.181915 0.152731
C  -5.924631 -0.480899 0.286966
C  0.99838 -1.793397 1.062104
C  -7.048378 0.042382 1.130926
C  -6.298326 -1.633333 -0.594194
C  3.435632 0.406259 -0.608331
C  3.795583 0.575674 0.664948
C  4.041338 1.105009 -1.766986
C  4.881347 1.470253 1.13329
C  4.881406 2.282026 -1.267853
C  5.736407 1.899125 -0.060684
C  2.325729 -0.574539 -0.655656
C  2.93131 -0.276683 1.515332
H  -3.595175 -1.248807 -0.970569
H  -2.125939 0.447925 1.155985
H  -1.92266 -0.709348 -2.57223
H  -2.523898 0.843206 -3.12329
H  -0.920792 0.734064 -2.404668
H  -1.842255 2.686006 -0.940085
H  -3.506881 2.524843 -1.494134
H  -3.126338 2.37857 0.22047
H  -4.580104 0.905653 1.041234
H  0.893137 -2.650582 0.402135
H  1.176269 -2.150336 2.073226
H  -7.443004 -0.739816 1.784664
H  -6.739679 0.880024 1.755918
H  -7.884231 0.374293 0.50961
H  -5.475966 -2.01619 -1.194965
H  -6.687711 -2.461205 0.003839
H  -7.101344 -1.345897 -1.277482
H  4.65923 0.399051 -2.330721
H  3.263248 1.442073 -2.45556
H  4.442734 2.341393 1.630087
H  5.488965 0.966528 1.888446
H  5.516081 2.64597 -2.076449
H  4.217267 3.106319 -0.993777
H  6.372211 2.736491 0.22864
H  6.404042 1.078427 -0.33728
elementType: O N C H
totalener: -1094.87013490 hartree
nucrepener: 2076.71992347 hartree
electener: -3171.59005837 hartree
oneelecener: -5615.91251959 hartree
twoeener: 2444.32246122 hartree
cpcmener: -0.04024594 hartree
kineticenergy: 1090.03856856 hartree
xcener: -105.974130262757 hartree
chargesum: -0.0000000
charge: -0.285279 -0.480099 -0.436809 -0.434109 -0.101441 0.107558 0.033276 -0.090995 -0.281635 -0.271338 -0.281071 0.411677 -0.053171 0.080955 -0.218320 -0.251955 -0.050286 -0.079772 -0.073845 -0.073880 -0.134362 -0.136805 0.330418 0.347058 0.096202 0.091738 0.094127 0.099655 0.094878 0.098043 0.097912 0.089895 0.120819 0.139096 0.127953 0.093916 0.088906 0.093677 0.090528 0.096112 0.096758 0.101842 0.093955 0.102686 0.094846 0.081111 0.078942 0.081508 0.079128
qa: -0.2853 -0.4801 -0.4368 -0.4341 -0.1014 0.1076 0.0333 -0.0910 -0.2816 -0.2713 -0.2811 0.4117 -0.0532 0.0810 -0.2183 -0.2520 -0.0503 -0.0798 -0.0738 -0.0739 -0.1344 -0.1368 0.3304 0.3471 0.0962 0.0917 0.0941 0.0997 0.0949 0.0980 0.0979 0.0899 0.1208 0.1391 0.1280 0.0939 0.0889 0.0937 0.0905 0.0961 0.0968 0.1018 0.0940 0.1027 0.0948 0.0811 0.0789 0.0815 0.0791
va: 2.1135 2.0238 2.0686 2.0767 3.1074 3.6783 3.7848 3.8133 3.8981 3.9103 3.8727 4.1563 3.7653 3.8786 3.9194 3.9397 3.6701 3.7068 3.9181 3.9168 3.9151 3.9156 4.1868 4.1932 1.0276 1.0356 1.0171 1.0017 1.0055 1.0011 1.0014 1.0065 1.0109 1.0159 1.0128 0.9962 1.0088 0.9962 1.0105 0.9967 0.9970 1.0042 1.0154 1.0049 1.0151 1.0094 1.0067 1.0093 1.0063
dispcorr: -0.022712908 hartree
energy: -1094.892847812620
dipole: -21.51915 22.44585 0.92670 13.39311 -11.54875 1.84435 -8.09559 8.05361 -0.04197
magnitude: 2.06450 au
magnitude: 5.24755 debye
