program: Orca
programVersion: 5.0.2
elementType: O O O O N C C C C C C C C C C C C C C C C C C C H H H H H H H H H H H H H H H H H H H H H H H H H
charge: 0
multiplicity: 1
keywords: wb97x-d3
keywords: def2-TZVPP
keywords: def2/J RIJCOSX
keywords: DEFGRID2
keywords: scfconv7
keywords: smallprint printgap noloewdin
keywords: NOSOSCF
formula: C19H25NO4
InChI: InChI=1/C19H25NO4/c1-11(2)9-14-15(19(14,3)4)18(23)24-10-20-16(21)12-7-5-6-8-13(12)17(20)22/h9,14-15H,5-8,10H2,1-4H3
49 atoms
O  -0.565139 1.212892 1.588989
O  -0.188596 -0.969212 1.262939
O  2.781981 -0.708279 1.998204
O  1.13253 2.847108 -0.307431
N  1.755468 1.191773 1.171838
C  -2.207309 -0.094633 -1.109284
C  -2.725424 -1.199461 -0.246977
C  -2.181642 0.044157 0.408471
C  -0.919184 -0.299127 -1.869151
C  -3.183887 0.806128 -1.823531
C  -4.173501 -1.523343 -0.153874
C  -0.895217 0.000732 1.12035
C  -4.782341 -1.966053 0.949206
C  0.729263 1.39136 2.149796
C  -6.244604 -2.290615 0.959457
C  -4.074936 -2.163421 2.254811
C  3.228716 0.106726 -0.23284
C  2.756896 1.156622 -0.906328
C  4.208474 -0.873362 -0.759761
C  3.13994 1.528316 -2.289224
C  4.313995 -0.717392 -2.2779
C  4.391518 0.749664 -2.698083
C  2.5989 0.084047 1.109357
C  1.787671 1.869465 -0.042849
H  -2.059899 -2.056992 -0.176839
H  -2.897861 0.75279 0.81071
H  -0.227635 -0.975532 -1.369106
H  -1.134586 -0.725458 -2.850723
H  -0.405834 0.651613 -2.031251
H  -4.097582 0.969066 -1.252102
H  -2.734365 1.782413 -2.01321
H  -3.464767 0.379639 -2.788661
H  -4.761001 -1.410879 -1.060937
H  0.906286 0.720883 2.989756
H  0.738444 2.415642 2.511796
H  -6.770325 -1.701875 1.715779
H  -6.715739 -2.100063 -0.004745
H  -6.410304 -3.339845 1.216424
H  -2.993696 -2.061211 2.180208
H  -4.42809 -1.44169 2.996422
H  -4.291128 -3.152993 2.664074
H  5.179801 -0.706001 -0.283807
H  3.911166 -1.889517 -0.491313
H  2.305438 1.304127 -2.961729
H  3.306243 2.605226 -2.364067
H  5.189804 -1.257158 -2.639499
H  3.442303 -1.181996 -2.747263
H  4.530747 0.823402 -3.777113
H  5.268164 1.212144 -2.236179
elementType: O N C H
totalener: -1094.86722220 hartree
nucrepener: 2164.63418514 hartree
electener: -3259.50140734 hartree
oneelecener: -5791.81689559 hartree
twoeener: 2532.31548824 hartree
cpcmener: -0.03870437 hartree
kineticenergy: 1090.04339603 hartree
xcener: -105.974034070822 hartree
chargesum: 0.0000000
charge: -0.281920 -0.479222 -0.426874 -0.432188 -0.108540 0.171820 -0.016146 -0.128947 -0.283740 -0.292184 -0.305982 0.410136 -0.015677 0.085726 -0.230102 -0.241002 -0.020376 -0.111375 -0.074645 -0.063197 -0.132918 -0.136988 0.313201 0.330741 0.104470 0.101727 0.092184 0.106965 0.091525 0.094493 0.099287 0.100136 0.126187 0.135881 0.144861 0.094623 0.090324 0.096730 0.078090 0.101293 0.100229 0.101697 0.093295 0.102374 0.095159 0.081266 0.078040 0.081310 0.078252
qa: -0.2819 -0.4792 -0.4269 -0.4322 -0.1085 0.1718 -0.0161 -0.1289 -0.2837 -0.2922 -0.3060 0.4101 -0.0157 0.0857 -0.2301 -0.2410 -0.0204 -0.1114 -0.0746 -0.0632 -0.1329 -0.1370 0.3132 0.3307 0.1045 0.1017 0.0922 0.1070 0.0915 0.0945 0.0993 0.1001 0.1262 0.1359 0.1449 0.0946 0.0903 0.0967 0.0781 0.1013 0.1002 0.1017 0.0933 0.1024 0.0952 0.0813 0.0780 0.0813 0.0783
va: 2.1139 2.0144 2.0809 2.0699 3.0799 3.7024 3.8297 3.8125 3.8901 3.9014 3.8893 4.1548 3.7070 3.8937 3.9303 3.9316 3.6068 3.7160 3.9117 3.9124 3.9137 3.9207 4.1912 4.1549 1.0243 1.0280 1.0120 1.0022 1.0067 1.0011 1.0032 0.9991 1.0018 1.0134 0.9935 0.9960 1.0058 0.9961 1.0203 0.9977 1.0006 1.0040 1.0157 1.0065 1.0160 1.0094 1.0080 1.0094 1.0062
dispcorr: -0.026067647 hartree
energy: -1094.893289846808
dipole: -17.80149 17.95668 0.15519 -9.95766 10.28860 0.33094 -13.69762 12.27991 -1.41771
magnitude: 1.46407 au
magnitude: 3.72137 debye
