program: Orca
programVersion: 5.0.2
elementType: O O O O N C C C C C C C C C C C C C C C C C C C H H H H H H H H H H H H H H H H H H H H H H H H H
charge: 0
multiplicity: 1
keywords: wb97x-d3
keywords: def2-TZVPP
keywords: def2/J RIJCOSX
keywords: DEFGRID2
keywords: scfconv7
keywords: smallprint printgap noloewdin
keywords: NOSOSCF
formula: C19H25NO4
InChI: InChI=1/C19H25NO4/c1-11(2)9-14-15(19(14,3)4)18(23)24-10-20-16(21)12-7-5-6-8-13(12)17(20)22/h9,14-15H,5-8,10H2,1-4H3
49 atoms
O  -0.594267 1.49737 1.462701
O  -0.255787 -0.712333 1.366607
O  2.706096 -0.425517 2.116542
O  1.163532 2.868757 -0.610505
N  1.729275 1.3818 1.058142
C  -2.284968 -0.015747 -1.067714
C  -2.796975 -1.052793 -0.118242
C  -2.243888 0.241154 0.431548
C  -1.004024 -0.291142 -1.817984
C  -3.254391 0.835977 -1.847748
C  -4.236198 -1.382277 0.022565
C  -0.94976 0.24818 1.133417
C  -4.742024 -2.214008 0.937861
C  0.704452 1.715811 1.99889
C  -6.204838 -2.535039 0.975819
C  -3.920632 -2.888367 1.992611
C  3.21771 0.12874 -0.179159
C  2.779663 1.103828 -0.976147
C  4.195151 -0.91569 -0.567438
C  3.206838 1.318242 -2.3795
C  4.346081 -0.927307 -2.089511
C  4.457192 0.484506 -2.662186
C  2.556383 0.263946 1.140279
C  1.798913 1.919616 -0.222194
H  -2.125031 -1.895933 0.010657
H  -2.953876 0.981125 0.784448
H  -0.478299 0.638926 -2.044931
H  -0.319051 -0.942395 -1.276928
H  -1.230535 -0.7784 -2.767994
H  -2.775502 1.768957 -2.14951
H  -3.576537 0.321613 -2.75519
H  -4.14392 1.095835 -1.27516
H  -4.920381 -0.928875 -0.688141
H  0.867291 1.146558 2.91315
H  0.733035 2.775379 2.237063
H  -6.760309 -2.020034 0.192409
H  -6.372578 -3.608652 0.858998
H  -6.641967 -2.258655 1.938518
H  -4.316177 -2.660136 2.984342
H  -3.96775 -3.974038 1.888163
H  -2.873172 -2.595156 1.982262
H  5.154542 -0.710058 -0.083455
H  3.873967 -1.892246 -0.199734
H  2.389737 1.032886 -3.04953
H  3.39235 2.378273 -2.564222
H  5.224021 -1.513003 -2.363402
H  3.482159 -1.430384 -2.532177
H  4.628792 0.439739 -3.737861
H  5.326501 0.983612 -2.226271
elementType: O N C H
totalener: -1094.86757374 hartree
nucrepener: 2154.94535038 hartree
electener: -3249.81292412 hartree
oneelecener: -5772.46259155 hartree
twoeener: 2522.64966743 hartree
cpcmener: -0.03900637 hartree
kineticenergy: 1090.06435260 hartree
xcener: -105.978615916468 hartree
chargesum: 0.0000000
charge: -0.280943 -0.478088 -0.427033 -0.433382 -0.104819 0.162973 -0.056117 -0.081000 -0.275197 -0.300598 -0.267463 0.404976 -0.025185 0.083520 -0.233280 -0.251533 -0.021323 -0.106295 -0.073114 -0.063324 -0.133915 -0.138344 0.311722 0.327471 0.102246 0.101037 0.091303 0.091889 0.106993 0.100296 0.104364 0.090289 0.126618 0.135385 0.145766 0.089087 0.094849 0.094946 0.096450 0.098550 0.078238 0.102002 0.093220 0.102124 0.095082 0.080979 0.078749 0.081278 0.078552
qa: -0.2809 -0.4781 -0.4270 -0.4334 -0.1048 0.1630 -0.0561 -0.0810 -0.2752 -0.3006 -0.2675 0.4050 -0.0252 0.0835 -0.2333 -0.2515 -0.0213 -0.1063 -0.0731 -0.0633 -0.1339 -0.1383 0.3117 0.3275 0.1022 0.1010 0.0913 0.0919 0.1070 0.1003 0.1044 0.0903 0.1266 0.1354 0.1458 0.0891 0.0948 0.0949 0.0964 0.0985 0.0782 0.1020 0.0932 0.1021 0.0951 0.0810 0.0787 0.0813 0.0786
va: 2.1148 2.0153 2.0807 2.0675 3.0791 3.7483 3.8484 3.8153 3.8794 3.9090 3.8828 4.1649 3.7141 3.8954 3.9294 3.9418 3.6107 3.7175 3.9111 3.9131 3.9147 3.9213 4.1947 4.1571 1.0184 1.0288 1.0084 1.0122 1.0018 1.0021 0.9980 1.0013 1.0038 1.0138 0.9928 1.0072 0.9952 0.9959 0.9978 0.9980 1.0210 1.0039 1.0159 1.0064 1.0158 1.0094 1.0076 1.0093 1.0062
dispcorr: -0.025481949 hartree
energy: -1094.893055691953
dipole: -17.29496 17.56074 0.26578 -13.43150 13.53075 0.09925 -13.45855 12.00133 -1.45723
magnitude: 1.48459 au
magnitude: 3.77352 debye
