program: Orca
programVersion: 5.0.2
elementType: O O O O N C C C C C C C C C C C C C C C C C C C H H H H H H H H H H H H H H H H H H H H H H H H H
charge: 0
multiplicity: 1
keywords: wb97x-d3
keywords: def2-TZVPP
keywords: def2/J RIJCOSX
keywords: DEFGRID2
keywords: scfconv7
keywords: smallprint printgap noloewdin
keywords: NOSOSCF
formula: C19H25NO4
InChI: InChI=1/C19H25NO4/c1-11(2)9-14-15(19(14,3)4)18(23)24-10-20-16(21)12-7-5-6-8-13(12)17(20)22/h9,14-15H,5-8,10H2,1-4H3
49 atoms
O  -0.664051 1.744243 1.406489
O  -0.531584 1.952894 -0.816752
O  2.507233 2.387037 -0.738512
O  1.080077 -0.547891 2.428112
N  1.606154 1.2146 1.039573
C  -3.572573 1.223141 -0.822234
C  -2.80017 -0.04416 -0.904887
C  -2.471101 0.968079 0.191906
C  -3.404946 2.256659 -1.908831
C  -4.968298 1.195097 -0.246477
C  -3.360202 -1.368399 -0.538757
C  -1.153577 1.610878 0.162276
C  -2.635174 -2.401897 -0.101265
C  0.680482 2.17357 1.560158
C  -3.273047 -3.717279 0.224263
C  -1.154115 -2.337068 0.118235
C  2.964904 0.038935 -0.403549
C  2.54297 -0.827069 0.518675
C  3.8881 -0.281459 -1.518182
C  2.897368 -2.26573 0.563903
C  4.536469 -1.643293 -1.266256
C  3.524429 -2.674575 -0.770404
C  2.362954 1.363697 -0.119301
C  1.6598 -0.107479 1.466044
H  -2.056041 -0.060527 -1.697488
H  -2.816728 0.706409 1.184709
H  -3.492336 3.268363 -1.509069
H  -2.45557 2.179354 -2.432727
H  -4.195104 2.128499 -2.651244
H  -5.694496 0.917587 -1.012841
H  -5.06931 0.49149 0.579772
H  -5.243794 2.182626 0.127235
H  -4.431831 -1.500328 -0.656525
H  0.81574 2.2876 2.632481
H  0.861991 3.135268 1.081805
H  -3.077129 -4.000432 1.261662
H  -4.352623 -3.697202 0.077946
H  -2.861788 -4.517562 -0.395788
H  -0.920466 -2.459942 1.178523
H  -0.651324 -3.154858 -0.402626
H  -0.70725 -1.402791 -0.216539
H  3.330016 -0.284099 -2.459468
H  4.645692 0.498981 -1.619137
H  3.590954 -2.444219 1.391186
H  2.009935 -2.866376 0.778041
H  5.012285 -1.995026 -2.182204
H  5.330998 -1.530947 -0.523421
H  4.003238 -3.648465 -0.665107
H  2.733293 -2.791879 -1.516142
elementType: O N C H
totalener: -1094.86829112 hartree
nucrepener: 2185.86826062 hartree
electener: -3280.73655173 hartree
oneelecener: -5834.28745584 hartree
twoeener: 2553.55090411 hartree
cpcmener: -0.03949646 hartree
kineticenergy: 1090.05469558 hartree
xcener: -105.977026124059 hartree
chargesum: -0.0000000
charge: -0.286655 -0.491442 -0.429214 -0.433196 -0.102121 0.176051 -0.026370 -0.099109 -0.282811 -0.291378 -0.302424 0.398192 0.005762 0.091035 -0.231461 -0.251109 -0.034563 -0.081588 -0.070387 -0.083014 -0.136781 -0.132215 0.325622 0.306227 0.107983 0.092005 0.101544 0.091590 0.094707 0.100118 0.092914 0.098672 0.125594 0.144302 0.132998 0.095326 0.090901 0.097363 0.099301 0.101548 0.076471 0.102192 0.094352 0.108965 0.094674 0.081515 0.078496 0.081169 0.078248
qa: -0.2867 -0.4914 -0.4292 -0.4332 -0.1021 0.1761 -0.0264 -0.0991 -0.2828 -0.2914 -0.3024 0.3982 0.0058 0.0910 -0.2315 -0.2511 -0.0346 -0.0816 -0.0704 -0.0830 -0.1368 -0.1322 0.3256 0.3062 0.1080 0.0920 0.1015 0.0916 0.0947 0.1001 0.0929 0.0987 0.1256 0.1443 0.1330 0.0953 0.0909 0.0974 0.0993 0.1015 0.0765 0.1022 0.0944 0.1090 0.0947 0.0815 0.0785 0.0812 0.0782
va: 2.1043 2.0100 2.0796 2.0659 3.0875 3.6875 3.8246 3.8079 3.8801 3.9158 3.8927 4.1347 3.7318 3.8910 3.9280 3.9461 3.6388 3.6778 3.9103 3.9170 3.9175 3.9135 4.1892 4.1769 1.0219 1.0337 0.9992 1.0196 1.0009 0.9990 1.0010 1.0024 1.0024 0.9935 1.0153 0.9959 1.0060 0.9961 1.0023 0.9985 1.0057 1.0053 1.0148 1.0042 1.0106 1.0093 1.0065 1.0096 1.0075
dispcorr: -0.026306603 hartree
energy: -1094.894597722245
dipole: -14.68263 14.92948 0.24686 -17.65933 15.91851 -1.74082 -8.70784 8.76041 0.05257
magnitude: 1.75902 au
magnitude: 4.47109 debye
