program: Orca
programVersion: 5.0.2
elementType: O O O O N C C C C C C C C C C C C C C C C C C C H H H H H H H H H H H H H H H H H H H H H H H H H
charge: 0
multiplicity: 1
keywords: wb97x-d3
keywords: def2-TZVPP
keywords: def2/J RIJCOSX
keywords: DEFGRID2
keywords: scfconv7
keywords: smallprint printgap noloewdin
keywords: NOSOSCF
formula: C19H25NO4
InChI: InChI=1/C19H25NO4/c1-11(2)9-14-15(19(14,3)4)18(23)24-10-20-16(21)12-7-5-6-8-13(12)17(20)22/h9,14-15H,5-8,10H2,1-4H3
49 atoms
O  -0.591081 1.256247 1.582621
O  -0.183857 -0.929591 1.315679
O  2.793627 -0.582404 2.065986
O  1.06022 2.841232 -0.372902
N  1.728875 1.263666 1.17079
C  -2.164393 -0.144917 -1.115855
C  -2.70949 -1.214933 -0.227019
C  -2.168125 0.046777 0.396537
C  -0.863481 -0.389937 -1.842386
C  -3.11521 0.741409 -1.881302
C  -4.163243 -1.516999 -0.145934
C  -0.898348 0.028479 1.137874
C  -4.783837 -1.967055 0.94772
C  0.697777 1.473564 2.141583
C  -6.25165 -2.266802 0.947583
C  -4.083272 -2.210746 2.24874
C  3.205091 0.142702 -0.203199
C  2.707961 1.154575 -0.915704
C  4.192792 -0.845052 -0.700512
C  3.064128 1.468982 -2.319929
C  4.268548 -0.759658 -2.226081
C  4.318096 0.687309 -2.715556
C  2.590231 0.168241 1.145887
C  1.736745 1.888786 -0.072649
H  -2.054096 -2.075474 -0.113923
H  -2.889556 0.77195 0.757564
H  -1.066564 -0.830433 -2.82027
H  -0.327203 0.546806 -2.011589
H  -0.197562 -1.071135 -1.314495
H  -4.029575 0.952523 -1.326804
H  -2.641569 1.697367 -2.112146
H  -3.397402 0.276536 -2.828163
H  -4.745945 -1.376491 -1.052062
H  0.885122 0.830693 3.00077
H  0.687292 2.507595 2.474616
H  -6.770801 -1.671547 1.703126
H  -6.71318 -2.063322 -0.018515
H  -6.438757 -3.313936 1.198724
H  -3.018311 -1.987991 2.21434
H  -4.527718 -1.607882 3.044973
H  -4.19658 -3.253646 2.555551
H  5.169297 -0.638292 -0.251412
H  3.918772 -1.8521 -0.378488
H  2.220649 1.206324 -2.967156
H  3.216158 2.543412 -2.444763
H  5.14528 -1.30399 -2.578543
H  3.395032 -1.257439 -2.65659
H  4.436356 0.712042 -3.799368
H  5.197042 1.181321 -2.292282
elementType: O N C H
totalener: -1094.86709598 hartree
nucrepener: 2167.88336245 hartree
electener: -3262.75045843 hartree
oneelecener: -5798.28981292 hartree
twoeener: 2535.53935449 hartree
cpcmener: -0.03868911 hartree
kineticenergy: 1090.03867533 hartree
xcener: -105.973122268748 hartree
chargesum: -0.0000000
charge: -0.282171 -0.478220 -0.426585 -0.431554 -0.110519 0.171275 -0.021517 -0.125266 -0.281235 -0.292759 -0.299634 0.408322 -0.019614 0.088021 -0.229887 -0.238790 -0.014501 -0.120616 -0.074772 -0.062311 -0.132677 -0.137902 0.310225 0.335059 0.105920 0.100541 0.107225 0.089192 0.093272 0.094306 0.099076 0.100857 0.126263 0.135306 0.144381 0.095116 0.090560 0.096094 0.076950 0.097682 0.101330 0.102128 0.092938 0.102560 0.095639 0.081440 0.078185 0.081612 0.079054
qa: -0.2822 -0.4782 -0.4266 -0.4316 -0.1105 0.1713 -0.0215 -0.1253 -0.2812 -0.2928 -0.2996 0.4083 -0.0196 0.0880 -0.2299 -0.2388 -0.0145 -0.1206 -0.0748 -0.0623 -0.1327 -0.1379 0.3102 0.3351 0.1059 0.1005 0.1072 0.0892 0.0933 0.0943 0.0991 0.1009 0.1263 0.1353 0.1444 0.0951 0.0906 0.0961 0.0770 0.0977 0.1013 0.1021 0.0929 0.1026 0.0956 0.0814 0.0782 0.0816 0.0791
va: 2.1116 2.0168 2.0811 2.0702 3.0809 3.7023 3.8372 3.8059 3.8871 3.9027 3.8857 4.1580 3.7123 3.8937 3.9284 3.9330 3.6005 3.7196 3.9115 3.9104 3.9124 3.9212 4.1926 4.1505 1.0228 1.0291 1.0024 1.0078 1.0122 1.0012 1.0032 0.9989 1.0018 1.0136 0.9933 0.9965 1.0059 0.9959 1.0206 0.9989 0.9994 1.0038 1.0159 1.0066 1.0161 1.0094 1.0081 1.0093 1.0062
dispcorr: -0.026209939 hartree
energy: -1094.893305920201
dipole: -17.63621 17.78257 0.14636 -10.75001 11.01076 0.26075 -13.84709 12.37877 -1.46832
magnitude: 1.49846 au
magnitude: 3.80878 debye
