program: Gaussian 09
title: 000063834
version: EM64L-G09RevD.01
frameworkgroup: C1[X(C21H14ClN3O2)]
method: RPBEPBE
basis: SDD
operation: Freq
keyword: #p
keyword: freq=noraman
keyword: PBEPBE/SDD
title: #p freq=noraman PBEPBE/SDD
converged: YES YES NO NO
title: Mulliken charges:
elementType: Cl O O N N N C C C C C C C C C C C C C C C C C C C C C H H H H H H H H H H H H H H
charge: -0.025812 -0.233307 -0.215324 -0.336164 -0.032711 -0.009027 0.112565 0.161167 -0.640516 0.132269 0.074720 0.566140 -0.322415 -0.361209 0.212224 -0.300779 -0.285143 -0.244811 -0.205549 0.021375 -0.236696 -0.244332 -0.219444 -0.267480 -0.186480 -0.365808 -0.158720 0.286228 0.302011 0.270860 0.260752 0.277103 0.232819 0.232185 0.256699 0.237511 0.235722 0.281368 0.248351 0.251113 0.238543
chargesum: 0.00000
title: Mulliken charges with hydrogens summed into heavy atoms:
elementType: Cl O O N N N C C C C C C C C C C C C C C C C C C C C C
charge: -0.025812 -0.233307 -0.215324 -0.336164 -0.032711 -0.009027 0.112565 0.161167 -0.052276 0.132269 0.074720 0.566140 -0.051556 -0.100457 0.212224 -0.300779 -0.008039 -0.011992 0.026636 0.021375 0.020003 -0.006821 0.016278 0.013889 0.061871 -0.114696 0.079823
polarizability: 3.44020929e+02 4.08758747e+01 2.41425396e+02 8.40458027e-01 -1.47853562e+01 2.05054145e+02
1716.lowfreq: -4.9945 -4.0222 0.0005 0.0011 0.0013 4.7555 12.9310 24.6076 33.9789
frequency: 12.8495 24.5104 33.9518 35.7285 42.3343 65.2638 88.1280 105.7655 111.8264 135.0513 147.5575 153.9099 172.5119 210.7386 260.4861 281.0885 288.4026 301.8063 312.9057 334.7339 384.2067 388.8106 415.2780 427.6470 446.5282 455.8964 488.9536 493.7284 504.8355 534.6392 538.2831 553.3720 568.2696 608.4031 619.8832 622.2905 648.0750 657.2837 690.5006 698.6929 720.6241 722.9002 747.7745 762.0033 783.7778 785.2940 795.3170 825.2378 842.6376 850.4309 872.1492 897.3433 918.9850 940.0880 951.9012 965.8926 975.9239 979.0337 979.9516 989.4016 1002.3795 1006.0104 1016.3284 1022.0619 1026.2685 1035.8333 1044.5542 1072.2525 1084.9269 1103.4978 1125.6953 1153.3075 1161.0368 1164.7923 1172.8033 1214.8635 1224.2836 1240.3141 1243.9862 1268.7012 1282.6685 1290.0914 1316.8948 1327.7718 1331.5631 1369.7194 1392.2511 1405.4548 1415.1793 1426.1577 1445.8513 1452.9290 1458.2801 1465.6259 1557.5916 1560.6314 1564.9541 1569.6533 1579.9176 1602.1508 1607.9595 1614.4595 1625.6972 3022.6720 3080.5212 3134.3592 3135.3386 3141.8688 3148.0794 3149.2391 3158.0203 3164.2625 3167.3348 3172.1886 3173.6893 3178.2635 3180.2338
redmass: 6.8051 7.7462 5.2486 6.9642 6.1615 5.7329 7.0456 10.0741 5.7088 6.0597 5.9848 5.5302 6.7951 5.2870 4.1674 5.4997 7.8989 4.4247 6.3329 4.6914 2.9567 8.2871 3.9374 4.0393 7.3751 3.4701 5.1427 6.8835 4.2080 4.3706 4.6200 8.9576 3.4284 7.2637 5.8230 5.6433 6.3027 6.0396 4.4563 6.5095 4.7904 5.7514 2.2756 1.2620 1.5302 1.6491 3.4607 6.1370 4.9039 3.0646 1.7678 1.5264 1.3176 3.0620 1.4367 6.8766 1.7102 1.3760 3.7406 1.3704 1.3327 4.7591 1.3535 2.8717 2.9929 2.2894 2.7342 3.0810 1.6080 1.8871 1.5890 1.3706 1.0824 1.1137 1.0567 2.0813 2.3356 2.6600 2.9125 1.7576 1.5823 1.8817 2.9141 3.7031 4.3185 10.5897 10.1697 1.1602 1.9826 2.2023 2.2121 2.7032 2.6929 2.7479 8.7421 6.2277 7.2518 5.8144 6.6897 7.2198 9.0700 7.9127 9.5665 1.0626 1.0957 1.0861 1.0885 1.0863 1.0903 1.0901 1.0913 1.0955 1.0949 1.0952 1.0998 1.1007 1.1001
irintensity: 0.3855 0.3027 0.5016 0.8635 1.6830 2.6041 5.6961 2.4254 0.8961 2.6798 0.4153 0.1259 0.1554 0.5313 4.5978 5.5958 1.8694 4.0038 1.7532 3.5525 2.5710 3.6772 1.5428 3.5365 2.6148 8.6705 1.1739 6.2721 1.8933 3.4525 3.8461 5.8913 10.6156 6.5054 7.9764 16.3567 12.5976 10.4361 17.9840 12.4412 8.3771 4.4396 20.1117 78.7243 72.5438 45.4955 1.8070 0.4598 13.9058 0.2371 0.0495 0.8298 1.0009 17.7793 0.3388 5.7681 16.6358 2.4996 38.8962 1.7714 0.0270 61.3496 0.3560 19.0446 4.9248 2.8747 6.0166 13.0462 9.2986 23.8024 1.6638 19.7292 3.0342 1.9695 0.4856 0.5378 53.6079 43.9157 8.5366 32.6882 3.6904 39.6636 79.6627 80.8587 108.9646 1.0537 29.7270 48.1018 18.4426 21.5776 1.9506 23.2673 58.1625 51.3688 237.2042 23.9623 12.6827 18.9757 11.0045 8.8357 84.0744 194.2661 147.5464 14.0734 1.1999 5.0253 8.7174 2.6059 10.9601 8.5754 12.7821 12.4269 10.9730 4.8638 26.1813 19.5794 8.7654
temp: 298.150 k
press: 1.00000 atm
elementType: 17 8 8 7 7 7 6 6 6 6 6 6 6 6 6 6 6 6 6 6 6 6 6 6 6 6 6 1 1 1 1 1 1 1 1 1 1 1 1 1 1
symmnumber: 1
zpe: 784901.1 jmol-1
zpe.correction: 0.298953 hartree
zpe.thermalcorrener: 0.320902 hartree
zpe.thermalcorrenthalpy: 0.321846 hartree
zpe.thermalcorrgfe: 0.244619 hartree
zpe.sumelectzpe: -1581.571872 hartree
zpe.sumelectthermal: -1581.549923 hartree
zpe.sumelectthermalent: -1581.548979 hartree
zpe.sumelectthermalfe: -1581.626206 hartree
dipole: 6.4103 -0.8281 -0.0775
dipole: 6.4640
quadrupole: -120.4989 -153.0844 -161.1073
quadrupole: 8.9091 -3.6618 -1.1124
quadrupole: 24.3979 -8.1875 -16.2104 8.9091 -3.6618 -1.1124
hfenergy: -1581.870825 hartree
pointgroup: C01 [X(C21H14Cl1N3O2)]
dipole: 2.5184775 0.3476694 0.0628958 debye
polarizability: 344.7768104|-39.7764606|241.5036326|-0.5870826|-14.110782|204.2200269 unknown
InChI: InChI=1S/C21H14ClN3O2/c22-15-8-2-4-11-18(15)25-20(13-19(26)17-10-5-6-12-23-17)24-16-9-3-1-7-14(16)21(25)27/h1-12H,13H2
charge 0 multiplicity 1
41 atoms
Cl -0.893306 -2.398449 -2.441068
O  -2.926016 -1.846965 0.865699
O  1.322692 1.021809 1.57224
N  -1.117132 -0.587733 0.042587
N  -1.353293 1.696915 -0.677346
N  3.624787 1.101698 -1.206317
C  -0.609395 0.622057 -0.479254
C  -3.322596 0.457679 0.188722
C  0.858477 0.704358 -0.822923
C  -2.504654 -0.747916 0.4085
C  -2.71976 1.639407 -0.348262
C  -0.274063 -1.755102 0.215331
C  -4.705888 0.441076 0.505125
C  -3.522724 2.794007 -0.5591
C  1.756481 0.974419 0.388215
C  -0.101969 -2.692243 -0.829318
C  0.339791 -2.001941 1.463568
C  -5.487124 1.588635 0.292349
C  -4.890542 2.766746 -0.240976
C  3.221727 1.194516 0.101012
C  0.67454 -3.852921 -0.654607
C  1.120264 -3.161362 1.65505
C  1.287413 -4.085049 0.59783
C  4.112039 1.48025 1.166815
C  5.476889 1.680667 0.87149
C  4.944512 1.296046 -1.474339
C  5.903729 1.587396 -0.473842
H  1.233462 -0.196336 -1.342031
H  0.992934 1.534813 -1.536959
H  -5.133009 -0.481156 0.912407
H  -3.042225 3.687271 -0.969161
H  0.19508 -1.273907 2.26698
H  -6.554842 1.579541 0.535529
H  -5.504467 3.659435 -0.404101
H  0.790269 -4.561655 -1.479518
H  1.588988 -3.345046 2.626905
H  1.887654 -4.989497 0.742209
H  3.714898 1.538572 2.18437
H  6.192288 1.905302 1.669201
H  5.238348 1.215644 -2.526796
H  6.952745 1.736419 -0.747918
