program: Orca
programVersion: 5.0.2
elementType: O O O O N C C C C C C C C C C C C C C C C C C C H H H H H H H H H H H H H H H H H H H H H H H H H
charge: 0
multiplicity: 1
keywords: wb97x-d3
keywords: def2-TZVPP
keywords: def2/J RIJCOSX
keywords: DEFGRID2
keywords: scfconv7
keywords: smallprint printgap noloewdin
keywords: NOSOSCF
formula: C19H25NO4
InChI: InChI=1/C19H25NO4/c1-11(2)9-14-15(19(14,3)4)18(23)24-10-20-16(21)12-7-5-6-8-13(12)17(20)22/h9,14-15H,5-8,10H2,1-4H3
49 atoms
O  -0.212798 0.742317 -0.023412
O  -1.810335 2.108294 -0.772016
O  2.276604 -0.133472 -2.135734
O  2.380012 1.776349 1.984781
N  2.049523 1.088161 -0.192909
C  -3.616258 0.301746 1.078147
C  -3.79685 -0.109474 -0.35023
C  -2.394008 0.004661 0.224221
C  -3.965165 1.718283 1.462354
C  -3.887731 -0.686138 2.187543
C  -4.308798 -1.438362 -0.73496
C  -1.490025 1.065291 -0.24648
C  -5.17922 -1.70773 -1.714092
C  0.781642 1.677361 -0.443013
C  -5.624572 -3.116276 -1.972153
C  -5.791436 -0.68987 -2.626912
C  3.862801 -0.327929 -0.317376
C  3.890004 0.228188 0.894983
C  4.871131 -1.278437 -0.843938
C  4.921995 -0.028373 1.928428
C  6.109876 -1.252383 0.053099
C  5.742112 -1.258764 1.536146
C  2.66722 0.169772 -1.03677
C  2.717731 1.126365 1.027769
H  -4.068323 0.708631 -1.008638
H  -1.898877 -0.930789 0.459781
H  -4.991209 1.7466 1.833841
H  -3.317982 2.080337 2.263491
H  -3.903914 2.419076 0.633041
H  -3.38453 -0.3716 3.103476
H  -4.957443 -0.73789 2.399187
H  -3.543699 -1.693174 1.956649
H  -3.938709 -2.277012 -0.152478
H  0.697814 2.607584 0.11745
H  0.687593 1.893828 -1.506412
H  -6.707251 -3.210916 -1.854821
H  -5.399389 -3.418035 -2.998384
H  -5.149626 -3.829512 -1.298843
H  -5.557918 -0.922777 -3.668823
H  -6.881165 -0.711131 -2.545934
H  -5.466498 0.330614 -2.435469
H  4.436535 -2.282376 -0.878476
H  5.129227 -1.025449 -1.874703
H  5.564136 0.85304 2.02154
H  4.454423 -0.165703 2.906047
H  6.745491 -2.107576 -0.178477
H  6.694901 -0.355934 -0.170235
H  6.645406 -1.303099 2.145333
H  5.166521 -2.160696 1.761605
elementType: O N C H
totalener: -1094.87163381 hartree
nucrepener: 2030.13114299 hartree
electener: -3125.00277679 hartree
oneelecener: -5522.36607367 hartree
twoeener: 2397.36329687 hartree
cpcmener: -0.03732409 hartree
kineticenergy: 1090.03224874 hartree
xcener: -105.971707854155 hartree
chargesum: -0.0000000
charge: -0.278783 -0.498954 -0.433161 -0.432247 -0.122905 0.101447 0.040540 -0.084683 -0.275151 -0.273964 -0.280163 0.418938 -0.051370 0.091975 -0.218340 -0.252996 -0.064691 -0.067966 -0.074331 -0.070301 -0.135556 -0.136064 0.340215 0.336961 0.093540 0.090572 0.097303 0.100784 0.090623 0.098528 0.098318 0.090285 0.121534 0.134904 0.131705 0.093723 0.093306 0.089322 0.096470 0.096374 0.091234 0.103024 0.093945 0.101858 0.094073 0.081299 0.078776 0.081546 0.078503
qa: -0.2788 -0.4990 -0.4332 -0.4322 -0.1229 0.1014 0.0405 -0.0847 -0.2752 -0.2740 -0.2802 0.4189 -0.0514 0.0920 -0.2183 -0.2530 -0.0647 -0.0680 -0.0743 -0.0703 -0.1356 -0.1361 0.3402 0.3370 0.0935 0.0906 0.0973 0.1008 0.0906 0.0985 0.0983 0.0903 0.1215 0.1349 0.1317 0.0937 0.0933 0.0893 0.0965 0.0964 0.0912 0.1030 0.0939 0.1019 0.0941 0.0813 0.0788 0.0815 0.0785
va: 2.1130 2.0015 2.0782 2.0789 3.1450 3.6905 3.7760 3.8488 3.9034 3.9135 3.8773 4.1159 3.7633 3.8830 3.9192 3.9398 3.6798 3.6875 3.9202 3.9173 3.9150 3.9171 4.1886 4.1897 1.0291 1.0333 0.9999 0.9989 1.0183 1.0014 1.0013 1.0065 1.0104 1.0025 1.0018 0.9960 0.9965 1.0087 0.9967 0.9969 1.0102 1.0047 1.0149 1.0043 1.0151 1.0095 1.0065 1.0092 1.0068
dispcorr: -0.021453535 hartree
energy: -1094.893087342010
dipole: -21.03495 22.34938 1.31443 -14.21774 12.59358 -1.62415 2.05263 -1.31635 0.73628
magnitude: 2.21534 au
magnitude: 5.63094 debye
