program: Orca
programVersion: 5.0.2
elementType: O O O O N C C C C C C C C C C C C C C C C C C C H H H H H H H H H H H H H H H H H H H H H H H H H
charge: 0
multiplicity: 1
keywords: wb97x-d3
keywords: def2-TZVPP
keywords: def2/J RIJCOSX
keywords: DEFGRID2
keywords: scfconv7
keywords: smallprint printgap noloewdin
keywords: NOSOSCF
formula: C19H25NO4
InChI: InChI=1/C19H25NO4/c1-11(2)9-14-15(19(14,3)4)18(23)24-10-20-16(21)12-7-5-6-8-13(12)17(20)22/h9,14-15H,5-8,10H2,1-4H3
49 atoms
O  -0.249413 1.496001 -0.025466
O  -1.524206 1.225546 -1.851983
O  3.067745 2.608522 1.020141
O  1.473816 -0.749729 -1.589031
N  2.009432 1.176032 -0.446869
C  -3.795352 1.075273 0.324906
C  -3.484174 -0.293291 -0.197571
C  -2.354291 0.587044 0.298984
C  -4.273106 2.123949 -0.648517
C  -4.409631 1.223475 1.695504
C  -3.81866 -1.523183 0.549956
C  -1.372155 1.119276 -0.65789
C  -4.538464 -2.552802 0.091333
C  0.862934 1.948959 -0.78834
C  -4.818197 -3.742091 0.960456
C  -5.141074 -2.629748 -1.278274
C  3.928301 0.392446 0.555486
C  3.457706 -0.598191 -0.203752
C  5.176773 0.33546 1.353662
C  4.087008 -1.931996 -0.354599
C  6.00767 -0.869654 0.910275
C  5.147813 -2.119796 0.731467
C  3.00077 1.546138 0.454393
C  2.207422 -0.137376 -0.852853
H  -3.540959 -0.369803 -1.278239
H  -1.944494 0.339312 1.271909
H  -3.919444 1.963544 -1.664074
H  -5.363868 2.115819 -0.68081
H  -3.963721 3.122445 -0.335189
H  -4.2414 2.230614 2.080761
H  -5.48855 1.065154 1.646654
H  -4.003599 0.521506 2.422231
H  -3.446797 -1.579675 1.568975
H  1.051491 2.990551 -0.538512
H  0.672219 1.874508 -1.856024
H  -5.894152 -3.896806 1.076206
H  -4.422773 -4.657145 0.512055
H  -4.38426 -3.638136 1.954755
H  -6.232048 -2.632995 -1.212792
H  -4.856383 -1.810038 -1.934397
H  -4.862084 -3.563989 -1.770442
H  5.741687 1.263282 1.240718
H  4.923678 0.262994 2.415843
H  3.329728 -2.717422 -0.302469
H  4.533339 -2.009007 -1.350757
H  6.504101 -0.63498 -0.035344
H  6.7961 -1.05722 1.639597
H  4.655418 -2.357939 1.67806
H  5.776564 -2.974823 0.482252
elementType: O N C H
totalener: -1094.87004970 hartree
nucrepener: 2050.63187147 hartree
electener: -3145.50192117 hartree
oneelecener: -5563.68657306 hartree
twoeener: 2418.18465189 hartree
cpcmener: -0.03885257 hartree
kineticenergy: 1090.04312996 hartree
xcener: -105.975151413390 hartree
chargesum: -0.0000000
charge: -0.285622 -0.486580 -0.434803 -0.437676 -0.098677 0.113924 0.040285 -0.136150 -0.279834 -0.265507 -0.282906 0.439315 -0.048208 0.080025 -0.218967 -0.252527 -0.081349 -0.056627 -0.073817 -0.071985 -0.135121 -0.136244 0.345201 0.335855 0.093881 0.093963 0.092125 0.097024 0.099884 0.099019 0.097724 0.089730 0.123207 0.127275 0.140218 0.093193 0.094720 0.089106 0.098985 0.089973 0.094989 0.093916 0.102699 0.094242 0.102033 0.078530 0.081234 0.078698 0.081627
qa: -0.2856 -0.4866 -0.4348 -0.4377 -0.0987 0.1139 0.0403 -0.1361 -0.2798 -0.2655 -0.2829 0.4393 -0.0482 0.0800 -0.2190 -0.2525 -0.0813 -0.0566 -0.0738 -0.0720 -0.1351 -0.1362 0.3452 0.3359 0.0939 0.0940 0.0921 0.0970 0.0999 0.0990 0.0977 0.0897 0.1232 0.1273 0.1402 0.0932 0.0947 0.0891 0.0990 0.0900 0.0950 0.0939 0.1027 0.0942 0.1020 0.0785 0.0812 0.0787 0.0816
va: 2.1079 2.0208 2.0771 2.0736 3.1087 3.6861 3.7583 3.8608 3.9057 3.9079 3.8630 4.1366 3.7570 3.8546 3.9200 3.9424 3.7106 3.6764 3.9196 3.9185 3.9148 3.9160 4.1974 4.1959 1.0320 1.0370 1.0179 1.0000 0.9994 1.0022 1.0020 1.0051 1.0089 1.0128 1.0182 0.9960 0.9962 1.0085 0.9966 1.0097 0.9973 1.0154 1.0047 1.0153 1.0046 1.0068 1.0094 1.0067 1.0092
dispcorr: -0.021867483 hartree
energy: -1094.891917187266
dipole: -21.13787 22.16348 1.02562 -15.13819 14.08848 -1.04971 6.76652 -5.46613 1.30039
magnitude: 1.96081 au
magnitude: 4.98399 debye
